BDBM345909 US10202367, Compound 55
SMILES CC1OC(=NC1CN1CCC(CC1)C(=O)NCCCN1C[C@@H](C)C[C@@H](C)C1)c1c(C)cc(C)cc1C
InChI Key InChIKey=ORFLUDVGQMENFG-AEANPNNESA-N
Data  1 EC50
  Tab Delimited (TSV)   2D SDfile   Computed 3D by Vconf -m prep SDfile
Find this compound or compounds like it in BindingDB:
Activity Spreadsheet -- Enzyme Inhibition Constant Data from BindingDB
Found 1 hit for monomerid = 345909
TargetGenome polyprotein(Hepatitis C virus genotype 2a (isolate HC-J6) (HCV...)
The United States of America, As Represented By The Secretary, Department of Health and Human Services
US Patent
LigandPNGBDBM345909(US10202367, Compound 55)
Affinity DataEC50:  190nM. Assay description: This example demonstrates the EC50 and CC50 values against HCV according to the HCVcc-RLuc reporter assay described in Example 5 and the cytotoxicity...
Ligand InfoPC cidPC sid
In DepthDetails US Patent