BDBM348885 NSC8676::US9791447, Compound SPI-03
SMILES Cc1cc(ccc1-c1ccc(cc1C)\N=N\c1cc(c2ccccc2c1N)S([O-])(=O)=O)\N=N\c1cc(c2ccccc2c1N)S(O)(=O)=O
InChI Key InChIKey=UVHHADIQQIICAV-HVMBLDELSA-M
Data  3 IC50
  Tab Delimited (TSV)   2D SDfile   Computed 3D by Vconf -m prep SDfile
Find this compound or compounds like it in BindingDB:
Activity Spreadsheet -- Enzyme Inhibition Constant Data from BindingDB
Found 3 hits for monomerid = 348885
TargetSentrin-specific protease 1(Homo sapiens (Human))
City of Hope
US Patent
LigandPNGBDBM348885(NSC8676 | US9791447, Compound SPI-03)
Affinity DataIC50:  3.80E+3nM. Assay description: The binding of SPI-01 to the enzyme-substrate complex was investigated. CSP analysis was carried out on the 40 kDa complex of 15N-labeled full length...
Ligand InfoPC cidPC sid
In DepthDetails US Patent
TargetSentrin-specific protease 7(Homo sapiens (Human))
City of Hope
US Patent
LigandPNGBDBM348885(NSC8676 | US9791447, Compound SPI-03)
Affinity DataIC50:  4.80E+3nM. Assay description: The binding of SPI-01 to the enzyme-substrate complex was investigated. CSP analysis was carried out on the 40 kDa complex of 15N-labeled full length...
Ligand InfoPC cidPC sid
In DepthDetails US Patent
TargetSentrin-specific protease 2(Homo sapiens (Human))
City of Hope
US Patent
LigandPNGBDBM348885(NSC8676 | US9791447, Compound SPI-03)
Affinity DataIC50:  2.40E+3nM. Assay description: The binding of SPI-01 to the enzyme-substrate complex was investigated. CSP analysis was carried out on the 40 kDa complex of 15N-labeled full length...
Ligand InfoPC cidPC sid
In DepthDetails US Patent