BDBM349538 US10207991, Ex. Cpd. No. 54::US10611728, Example Compound 54::US11691947, Example 54
SMILES CC(C)(CCc1ccc(O)c(OC(F)(F)F)c1)N1Cc2cccc(F)c2C1
InChI Key InChIKey=MLUVEMSNRPMVHW-UHFFFAOYSA-N
Data  8 KI  1 IC50
  Tab Delimited (TSV)   2D SDfile   Computed 3D by Vconf -m prep SDfile
Find this compound or compounds like it in BindingDB:
Activity Spreadsheet -- Enzyme Inhibition Constant Data from BindingDB
Found 9 hits for monomerid = 349538
TargetSigma intracellular receptor 2(Homo sapiens (Human))
Cognition Therapeutics
US Patent
LigandPNGBDBM349538(US10207991, Ex. Cpd. No. 54 | US10611728, Example ...)
Affinity DataKi:  18nM. Assay description: Radioligand binding assays for Sigma-1 receptors and Sigma-2 receptors were carried out by a commercial contract research organization. For Sigma-1 b...
Ligand InfoPC cidPC sid
In DepthDetails US Patent
TargetSigma intracellular receptor 2(Rattus norvegicus (Rat))
Cognition Therapeutics
US Patent
LigandPNGBDBM349538(US10207991, Ex. Cpd. No. 54 | US10611728, Example ...)
Affinity DataKi:  18nM. Assay description: The affinity of candidate sigma-2 ligand compounds at sigma-1 and sigma-2 receptors was also determined by displacement of different known labeled si...
Ligand InfoPC cidPC sid
In DepthDetails US Patent
TargetSigma intracellular receptor 2(Homo sapiens (Human))
Cognition Therapeutics
US Patent
LigandPNGBDBM349538(US10207991, Ex. Cpd. No. 54 | US10611728, Example ...)
Affinity DataKi:  18nM. Assay description: The affinity of candidate sigma-2 ligand compounds at sigma-1 and sigma-2 receptors was also determined by displacement of different known labeled si...
Ligand InfoPC cidPC sid
In DepthDetails US Patent
TargetSigma intracellular receptor 2(Homo sapiens (Human))
Cognition Therapeutics
US Patent
LigandPNGBDBM349538(US10207991, Ex. Cpd. No. 54 | US10611728, Example ...)
Affinity DataKi:  18nM. Assay description: Radioligand binding assays for Sigma-1 receptors and Sigma-2 receptors were carried out by a commercial contract research organization. For Sigma-1 b...
Ligand InfoPC cidPC sid
In DepthDetails US Patent
TargetSigma non-opioid intracellular receptor 1(Homo sapiens (Human))
Cognition Therapeutics
US Patent
LigandPNGBDBM349538(US10207991, Ex. Cpd. No. 54 | US10611728, Example ...)
Affinity DataKi:  74nM. Assay description: Radioligand binding assays for Sigma-1 receptors and Sigma-2 receptors were carried out by a commercial contract research organization. For Sigma-1 b...
Ligand InfoPC cidPC sid
In DepthDetails US Patent
TargetSigma non-opioid intracellular receptor 1(Homo sapiens (Human))
Cognition Therapeutics
US Patent
LigandPNGBDBM349538(US10207991, Ex. Cpd. No. 54 | US10611728, Example ...)
Affinity DataKi:  74nM. Assay description: The affinity of candidate sigma-2 ligand compounds at sigma-1 and sigma-2 receptors was also determined by displacement of different known labeled si...
Ligand InfoPC cidPC sid
In DepthDetails US Patent
TargetSigma non-opioid intracellular receptor 1(Homo sapiens (Human))
Cognition Therapeutics
US Patent
LigandPNGBDBM349538(US10207991, Ex. Cpd. No. 54 | US10611728, Example ...)
Affinity DataKi:  74nM. Assay description: Radioligand binding assays for Sigma-1 receptors and Sigma-2 receptors were carried out by a commercial contract research organization. For Sigma-1 b...
Ligand InfoPC cidPC sid
In DepthDetails US Patent
TargetSigma non-opioid intracellular receptor 1(Cavia porcellus (Guinea pig))
Cognition Therapeutics
US Patent
LigandPNGBDBM349538(US10207991, Ex. Cpd. No. 54 | US10611728, Example ...)
Affinity DataKi:  74nM. Assay description: The affinity of candidate sigma-2 ligand compounds at sigma-1 and sigma-2 receptors was also determined by displacement of different known labeled si...
Ligand InfoPC cidPC sid
In DepthDetails US Patent
TargetPotassium voltage-gated channel subfamily H member 2(Homo sapiens (Human))
Cognition Therapeutics
US Patent
LigandPNGBDBM349538(US10207991, Ex. Cpd. No. 54 | US10611728, Example ...)
Affinity DataIC50:  2.50E+3nM. Assay description: Representative sigma-2 antagonists test compounds do not induce neuronal or glial toxicity with acute or chronic dosing in vitro. The sigma-2 recepto...
Ligand InfoPC cidPC sid
In DepthDetails US Patent