BDBM349930 5-((2S,4S)-2-(4-chlorobenzyl)-4-methoxy-[1,4′-bipiperidin]-1′-yl)-4H-1,2,4-triazol-3-amine ::US10208020, Example 20::US10538508, Example 20::US9944624, Ex. 20
SMILES CO[C@H]1CCN(C(Cc2ccc(Cl)cc2)C1)C1CCN(CC1)c1nnc(N)[nH]1
InChI Key
Data  6 IC50
  Tab Delimited (TSV)   2D SDfile   Computed 3D by Vconf -m prep SDfile
Find this compound or compounds like it in BindingDB:
Activity Spreadsheet -- Enzyme Inhibition Constant Data from BindingDB
Found 6 hits for monomerid = 349930
TargetAcidic mammalian chitinase(Homo sapiens (Human))
Oncoarendi Therapeutics
US Patent
LigandPNGBDBM349930(5-((2S,4S)-2-(4-chlorobenzyl)-4-methoxy-[1,4′...)
Affinity DataIC50: <100nM. Assay description: An enzymatic assay with recombinant human AMCase was used in order to establish inhibitory activity of the compounds (Boot et al., 2001, JBC: 276). T...
Ligand InfoPC cidPC sid
In DepthDetails US Patent
TargetChitotriosidase-1(Homo sapiens (Human))
Oncoarendi Therapeutics
US Patent
LigandPNGBDBM349930(5-((2S,4S)-2-(4-chlorobenzyl)-4-methoxy-[1,4′...)
Affinity DataIC50:  550nM. Assay description: An enzymatic assay with recombinant human CHIT1 was used in order to establish inhibitory activity of the compounds (Boot et al., 2001, JBC: 276). Th...
Ligand InfoPC cidPC sid
In DepthDetails US Patent
TargetChitotriosidase-1(Homo sapiens (Human))
Oncoarendi Therapeutics
US Patent
LigandPNGBDBM349930(5-((2S,4S)-2-(4-chlorobenzyl)-4-methoxy-[1,4′...)
Affinity DataIC50:  550nM. Assay description: An enzymatic assay with recombinant human CHIT1 was used in order to establish inhibitory activity of the compounds (Boot et al., 2001, JBC: 276). Th...
Ligand InfoPC cidPC sid
In DepthDetails US Patent
TargetChitotriosidase-1(Homo sapiens (Human))
Oncoarendi Therapeutics
US Patent
LigandPNGBDBM349930(5-((2S,4S)-2-(4-chlorobenzyl)-4-methoxy-[1,4′...)
Affinity DataIC50:  550nM. Assay description: An enzymatic assay with recombinant human CHIT1 was used in order to establish inhibitory activity of the compounds (Boot et al., 2001, JBC: 276). Th...
Ligand InfoPC cidPC sid
In DepthDetails US Patent
TargetAcidic mammalian chitinase(Homo sapiens (Human))
Oncoarendi Therapeutics
US Patent
LigandPNGBDBM349930(5-((2S,4S)-2-(4-chlorobenzyl)-4-methoxy-[1,4′...)
Affinity DataIC50: <100nM. Assay description: An enzymatic assay with recombinant human AMCase was used in order to establish inhibitory activity of the compounds (Boot et al., 2001, JBC: 276). T...
Ligand InfoPC cidPC sid
In DepthDetails US Patent
TargetAcidic mammalian chitinase(Homo sapiens (Human))
Oncoarendi Therapeutics
US Patent
LigandPNGBDBM349930(5-((2S,4S)-2-(4-chlorobenzyl)-4-methoxy-[1,4′...)
Affinity DataIC50: <100nM. Assay description: An enzymatic assay with recombinant human AMCase was used in order to establish inhibitory activity of the compounds (Boot et al., 2001, JBC: 276). T...
Ligand InfoPC cidPC sid
In DepthDetails US Patent