BDBM35121 5-vinyl-3-pyridinecarbonitrile, 11c
SMILES Cc1c(Nc2c(\C=C\CCCN3CCOCC3)cncc2C#N)ccc2[nH]ccc12
InChI Key InChIKey=XHHYVFRQYUOODP-HWKANZROSA-N
Data  2 IC50
  Tab Delimited (TSV)   2D SDfile   Computed 3D by Vconf -m prep SDfile
Find this compound or compounds like it in BindingDB:
Activity Spreadsheet -- Enzyme Inhibition Constant Data from BindingDB
Found 2 hits for monomerid = 35121
TargetProtein kinase C delta type(Homo sapiens (Human))
Wyeth Research
LigandPNGBDBM35121(5-vinyl-3-pyridinecarbonitrile, 11c)
Affinity DataIC50:  120nM. Assay description: All IC50s were measured by using a modified IMAP protocol from Molecular Devices. The kinase reaction was carried out in a Corning Costar 384 well pl...
In DepthDetails ArticlePubMed
TargetProtein kinase C theta type(Homo sapiens (Human))
Wyeth Research
LigandPNGBDBM35121(5-vinyl-3-pyridinecarbonitrile, 11c)
Affinity DataIC50:  34nMpH: 7.2 T: 2°C. Assay description: All IC50s were measured by using a modified IMAP protocol from Molecular Devices. The kinase reaction was carried out in a Corning Costar 384 well pl...
In DepthDetails ArticlePubMed