BDBM351740 US9796710, Compound 33
SMILES CC[C@@H]1N(C[C@H]2CC[C@@H](CC2)C(F)(F)F)Cc2cc(cnc12)C(=O)N[C@@H](CO)c1ccc(cn1)S(=O)(=O)CC
InChI Key InChIKey=MSBOECCXJARGLY-IAUHIMIASA-N
Data  2 KI
  Tab Delimited (TSV)   2D SDfile   Computed 3D by Vconf -m prep SDfile
Find this compound or compounds like it in BindingDB:
Activity Spreadsheet -- Enzyme Inhibition Constant Data from BindingDB
Found 2 hits for monomerid = 351740
TargetNuclear receptor ROR-gamma(Homo sapiens (Human))TBA
LigandPNGBDBM351740(US9796710, Compound 33)
Affinity DataKi: <100nM. Assay description: Inhibition of RORgamma (unknown origin)
Ligand InfoPC cidPC sid
In DepthDetails PubMed
TargetNuclear receptor ROR-gamma(Homo sapiens (Human))TBA
LigandPNGBDBM351740(US9796710, Compound 33)
Affinity DataKi: <100nM. Assay description: Compounds of the present invention were tested for ability to bind to ROR in a cell-free competition assay with commercially available radio-ligand (...
Ligand InfoPC cidPC sid
In DepthDetails US Patent