BDBM35446 2,8-bis(trifluoromethyl)-1H-quinolin-4-one::2,8-bis(trifluoromethyl)-4-quinolone::CC-PMLSC-DMA-P104::cid_736140
SMILES Oc1cc(nc2c(cccc12)C(F)(F)F)C(F)(F)F
InChI Key InChIKey=JIWHKBAFGFPZKM-UHFFFAOYSA-N
Data  1 IC50
PDB links: 1 PDB ID matches this monomer.
  Tab Delimited (TSV)   2D SDfile   Computed 3D by Vconf -m prep SDfile
Find this compound or compounds like it in BindingDB:
Activity Spreadsheet -- Enzyme Inhibition Constant Data from BindingDB
Found 1 hit for monomerid = 35446
TargetDual specificity protein phosphatase 1(Homo sapiens (Human))
Cc_Pmlsc
Curated by PubChem BioAssay
LigandPNGBDBM35446(2,8-bis(trifluoromethyl)-1H-quinolin-4-one | 2,8-b...)
Affinity DataIC50: >5.00E+4nMpH: 7.0 T: 2°C. Assay description: The MKP-1 dose response assay SAR support Assay - has been developed to test the activity of a series Analog compounds synthesized by the PMLSC Chemi...
In DepthDetails PCBioAssay