BDBM355787 N-Cyclopropyl-3-(2,3-dihydro-1H-inden-5-yl)-3H-imidazo[4,5-b]pyridine-2-carboxamide::US9815832, 64
SMILES O=C(NC1CC1)c1nc2cccnc2n1-c1ccc2CCCc2c1
InChI Key InChIKey=IKSFLILQDWZZLV-UHFFFAOYSA-N
Data  2 IC50
  Tab Delimited (TSV)   2D SDfile   Computed 3D by Vconf -m prep SDfile
Find this compound or compounds like it in BindingDB:
Activity Spreadsheet -- Enzyme Inhibition Constant Data from BindingDB
Found 2 hits for monomerid = 355787
TargetcAMP-specific 3',5'-cyclic phosphodiesterase 4D(Homo sapiens (Human))
Pfizer
US Patent
LigandPNGBDBM355787(N-Cyclopropyl-3-(2,3-dihydro-1H-inden-5-yl)-3H-imi...)
Affinity DataIC50:  1.57E+4nM. Assay description: The PDE4B and 4D assays use scintillation proximity assay (SPA) technology to measure the inhibition of human recombinant PDE4B and PDE4D enzyme acti...
Ligand InfoPC cidPC sid
In DepthDetails US Patent
TargetcAMP-specific 3',5'-cyclic phosphodiesterase 4B(Homo sapiens (Human))
Pfizer
US Patent
LigandPNGBDBM355787(N-Cyclopropyl-3-(2,3-dihydro-1H-inden-5-yl)-3H-imi...)
Affinity DataIC50:  206nM. Assay description: The PDE4B and 4D assays use scintillation proximity assay (SPA) technology to measure the inhibition of human recombinant PDE4B and PDE4D enzyme acti...
Ligand InfoPC cidPC sid
In DepthDetails US Patent