BDBM356303 US9815850, Compound 70A
SMILES O=C(N[C@H]1COc2ccccc2-n2cnnc12)c1cc(Cc2ccccc2)[nH]n1
InChI Key
Data  1 IC50
  Tab Delimited (TSV)   2D SDfile   Computed 3D by Vconf -m prep SDfile
Find this compound or compounds like it in BindingDB:
Activity Spreadsheet -- Enzyme Inhibition Constant Data from BindingDB
Found 1 hit for monomerid = 356303
TargetReceptor-interacting serine/threonine-protein kinase 1(Homo sapiens (Human))
Denali Therapeutics
US Patent
LigandPNGBDBM356303(US9815850, Compound 70A)
Affinity DataIC50:  500nM. Assay description: Assay was performed in polystyrene low volume 384-well black plate, at Room Temperature (RT) in a final volume of 10.1 μl/well using 10 nM of GS...
Ligand InfoPC cidPC sid
In DepthDetails US Patent