BDBM356343 US10604535, Example 100B::US9815850, Compound 100B::US9896458, No. 100B
SMILES CN1c2ncccc2[C@H]2C[C@H]2[C@@H](NC(=O)c2cc(Oc3ccccc3F)ccn2)C1=O
InChI Key InChIKey=MSDXAABDMCXHGO-JXXFODFXSA-N
Data  3 IC50
  Tab Delimited (TSV)   2D SDfile   Computed 3D by Vconf -m prep SDfile
Find this compound or compounds like it in BindingDB:
Activity Spreadsheet -- Enzyme Inhibition Constant Data from BindingDB
Found 3 hits for monomerid = 356343
TargetReceptor-interacting serine/threonine-protein kinase 1(Homo sapiens (Human))
Denali Therapeutics
US Patent
LigandPNGBDBM356343(US10604535, Example 100B | US9815850, Compound 100...)
Affinity DataIC50:  500nM. Assay description: Test compounds were diluted in DMSO and 0.1 μL of solution was dispensed to each well of a 384-well white solid microplate. The assay buffer was...
Ligand InfoPC cidPC sid
In DepthDetails US Patent
TargetReceptor-interacting serine/threonine-protein kinase 1(Homo sapiens (Human))
Denali Therapeutics
US Patent
LigandPNGBDBM356343(US10604535, Example 100B | US9815850, Compound 100...)
Affinity DataIC50: <1.00E+3nM. Assay description: Fluorescent polarization binding assay was performed in polystyrene low volume 384-well black plate, at Room Temperature (RT) in a final volume of 10...
Ligand InfoPC cidPC sid
In DepthDetails US Patent
TargetReceptor-interacting serine/threonine-protein kinase 1(Homo sapiens (Human))
Denali Therapeutics
US Patent
LigandPNGBDBM356343(US10604535, Example 100B | US9815850, Compound 100...)
Affinity DataIC50:  500nM. Assay description: Assay was performed in polystyrene low volume 384-well black plate, at Room Temperature (RT) in a final volume of 10.1 μl/well using 10 nM of GS...
Ligand InfoPC cidPC sid
In DepthDetails US Patent