BDBM357925 US10214536, Compound 292
SMILES CN(C)CC#Cc1ccc2oc3nc(N)c(cc3c(=O)c2c1)C(O)=O
InChI Key InChIKey=IXIDBGUSMRFEAI-UHFFFAOYSA-N
Data  1 IC50
  Tab Delimited (TSV)   2D SDfile   Computed 3D by Vconf -m prep SDfile
Find this compound or compounds like it in BindingDB:
Activity Spreadsheet -- Enzyme Inhibition Constant Data from BindingDB
Found 1 hit for monomerid = 357925
TargetSerine/threonine-protein kinase TBK1(Homo sapiens (Human))
The Regents of The University of Michigan
US Patent
LigandPNGBDBM357925(US10214536, Compound 292)
Affinity DataIC50:  4.24E+3nM. Assay description: Kinase assays are commonly used for determining the ability of a small molecule to inhibit enzyme activity. By measuring the degree of phosphorylatio...
Ligand InfoPC cidPC sid
In DepthDetails US Patent