BDBM358799 US10214544, Example 112
SMILES COc1nn2cc(nc2s1)-c1cc2c(OCc3ccc4CCN(C(=O)c5csc(n5)-c5ccccc5)c4c3)cc(OC)cc2o1
InChI Key InChIKey=DFYWPYCZGTXPJA-UHFFFAOYSA-N
Data  1 EC50
  Tab Delimited (TSV)   2D SDfile   Computed 3D by Vconf -m prep SDfile
Find this compound or compounds like it in BindingDB:
Activity Spreadsheet -- Enzyme Inhibition Constant Data from BindingDB
Found 1 hit for monomerid = 358799
TargetProteinase-activated receptor 4(Homo sapiens (Human))
Universite De Montreal
US Patent
LigandPNGBDBM358799(US10214544, Example 112)
Affinity DataEC50:  0.550nM. Assay description: FLIPR-based calcium mobilization assay in HEK293 cells was used to measure PAR4 antagonism, agonism, and selectivity against PAR1. The activity of th...
Ligand InfoPC cidPC sid
In DepthDetails US Patent