BDBM359522 US10221142, Example 17D
SMILES CC(C)(C)OC(=O)N1CCc2c(C1)n(nc2-c1ccc(cc1F)C(O)=O)C(=O)c1c(Cl)cccc1C1(CC1)C(F)(F)F
InChI Key InChIKey=KROUEHRTIJJEJW-UHFFFAOYSA-N
Data  1 IC50
  Tab Delimited (TSV)   2D SDfile   Computed 3D by Vconf -m prep SDfile
Find this compound or compounds like it in BindingDB:
Activity Spreadsheet -- Enzyme Inhibition Constant Data from BindingDB
Found 1 hit for monomerid = 359522
TargetNuclear receptor ROR-gamma(Homo sapiens (Human))
Merck Sharp & Dohme
US Patent
LigandPNGBDBM359522(US10221142, Example 17D)
Affinity DataIC50:  235nM. Assay description: The compounds of the invention inhibit RORgammaT activity. Activation of RORgammaT activity can be measured using, e.g., biochemical TR-FRET assay. I...
Ligand InfoPC cidPC sid
In DepthDetails US Patent