BDBM359808 US9822103, Example 68::rac-(3aS,8bS)—N-((4,6-Dimethyl-2-oxo-1,2-dihydropyridin-3-yl)methyl)-3a-methyl-5-(4-(piperazin-1-yl)phenyl)-2,3,3a,8b-tetrahydro-1H-cyclopenta[b]benzofuran-7-carboxamide
SMILES Cc1cc(C)c(CNC(=O)c2cc3[C@@H]4CCC[C@]4(C)Oc3c(c2)-c2ccc(cc2)N2CCNCC2)c(=O)[nH]1
InChI Key
Data  1 IC50
  Tab Delimited (TSV)   2D SDfile   Computed 3D by Vconf -m prep SDfile
Find this compound or compounds like it in BindingDB:
Activity Spreadsheet -- Enzyme Inhibition Constant Data from BindingDB
Found 1 hit for monomerid = 359808
TargetHistone-lysine N-methyltransferase EZH2(Homo sapiens (Human))
Bristol-Myers Squibb
US Patent
LigandPNGBDBM359808(US9822103, Example 68 | rac-(3aS,8bS)—N-((4,6-Dime...)
Affinity DataIC50:  750nM. Assay description: EZH2 Histone Methyl Transferase Assay: The effectiveness of compounds of the present invention as inhibitors of histone methyl transferases can be r...
Ligand InfoPC cidPC sid
In DepthDetails US Patent