BDBM359854 US9822120, Compound 8
SMILES Cc1ccc(COc2cc(F)cc(Oc3ccc(cc3)-c3nc(C4CCOCC4)n4ccnc(N)c34)c2)cn1
InChI Key InChIKey=HWPMTKOLLDZJMV-UHFFFAOYSA-N
Data  1 KI  1 EC50
  Tab Delimited (TSV)   2D SDfile   Computed 3D by Vconf -m prep SDfile
Find this compound or compounds like it in BindingDB:
Activity Spreadsheet -- Enzyme Inhibition Constant Data from BindingDB
Found 2 hits for monomerid = 359854
TargetTyrosine-protein kinase BTK(Homo sapiens (Human))
Pharmascience
US Patent
LigandPNGBDBM359854(US9822120, Compound 8)
Affinity DataKi: <100nM. Assay description: Method A: Fluorescence polarization-based kinase assays were performed in 384 well-plate format using histidine tagged recombinant human full-length ...
Ligand InfoPC cidPC sid
In DepthDetails US Patent
TargetTyrosine-protein kinase BTK(Homo sapiens (Human))
Pharmascience
US Patent
LigandPNGBDBM359854(US9822120, Compound 8)
Affinity DataEC50: <100nM. Assay description: Method A: Fluorescence polarization-based kinase assays were performed in 384 well-plate format using histidine tagged recombinant human full-length ...
Ligand InfoPC cidPC sid
In DepthDetails US Patent