BDBM360635 (11bR)-N-pyrimidin-2-yl-2,3,4,6,7,11b-hexahydro-1H-pyrazino[2,1-a]isoquinolin-9-amine::US9828374, Example 22
SMILES C1CN2CCc3cc(Nc4ncccn4)ccc3[C@@H]2CN1
InChI Key InChIKey=CMBIKSJIJOOFBB-HNNXBMFYSA-N
Data  2 KI
  Tab Delimited (TSV)   2D SDfile   Computed 3D by Vconf -m prep SDfile
Find this compound or compounds like it in BindingDB:
Activity Spreadsheet -- Enzyme Inhibition Constant Data from BindingDB
Found 2 hits for monomerid = 360635
TargetTrace amine-associated receptor 1(Rattus norvegicus (Rat))
Hoffmann-La Roche
US Patent
LigandPNGBDBM360635((11bR)-N-pyrimidin-2-yl-2,3,4,6,7,11b-hexahydro-1H...)
Affinity DataKi:  537nM. Assay description: The TAAR1 radioligand 3[H]-(S)-4-[(ethyl-phenyl-amino)-methyl]-4,5-dihydro-oxazol-2-ylamine (described in WO 2008/098857) was used at a concentration...
Ligand InfoPC cidPC sid
In DepthDetails US Patent
TargetTrace amine-associated receptor 1(Mus musculus (Mouse))
Hoffmann-La Roche
US Patent
LigandPNGBDBM360635((11bR)-N-pyrimidin-2-yl-2,3,4,6,7,11b-hexahydro-1H...)
Affinity DataKi:  3.92E+3nM. Assay description: HEK-293 cells stably expressing mouse TAAR1 were maintained at 37° C. and 5% CO2 in DMEM high glucose medium, containing fetal calf serum (10%, heat ...
Ligand InfoPC cidPC sid
In DepthDetails US Patent