BDBM362704 US9840498, 31
SMILES Cc1nc(N)nc(N2C[C@@H](O)C[C@H]2c2nc3ccc(F)c(-c4cn(C)cn4)c3c(=O)n2-c2ccccc2)c1C#N
InChI Key InChIKey=WZIIFLLKOMHMBA-JTSKRJEESA-N
Data  3 IC50
  Tab Delimited (TSV)   2D SDfile   Computed 3D by Vconf -m prep SDfile
Find this compound or compounds like it in BindingDB:
Activity Spreadsheet -- Enzyme Inhibition Constant Data from BindingDB
Found 3 hits for monomerid = 362704
LigandPNGBDBM362704(US9840498, 31)
Affinity DataIC50:  570nM. Assay description: The TR-FRET Adapta Universal Kinase Assay Kit was purchased from Invitrogen Corporation (Carlsbad/CA, USA) (Cat. No. PV5099). The kit contains the fo...
Ligand InfoPC cidPC sid
In DepthDetails US Patent
LigandPNGBDBM362704(US9840498, 31)
Affinity DataIC50:  110nM. Assay description: The TR-FRET Adapta Universal Kinase Assay Kit was purchased from Invitrogen Corporation (Carlsbad/CA, USA) (Cat. No. PV5099). The kit contains the fo...
Ligand InfoPC cidPC sid
In DepthDetails US Patent
LigandPNGBDBM362704(US9840498, 31)
Affinity DataIC50:  13nM. Assay description: The TR-FRET Adapta Universal Kinase Assay Kit was purchased from Invitrogen Corporation (Carlsbad/CA, USA) (Cat. No. PV5099). The kit contains the fo...
Ligand InfoPC cidPC sid
In DepthDetails US Patent