BDBM362837 5-(trans-4-Aminocyclohexyl)-N-butyl-8-{[(tetrahydropyran-4-yl)amino]methyl}-5,6-dihydropyrimido[4,5-c]isoquinolin-3-amine::US9840503, Example 10
SMILES CCCCNc1ncc2-c3ccc(CNC4CCOCC4)cc3CN([C@H]3CC[C@H](N)CC3)c2n1
InChI Key InChIKey=GEQBPHKYMKHGDF-AFARHQOCSA-N
Data  3 IC50
  Tab Delimited (TSV)   2D SDfile   Computed 3D by Vconf -m prep SDfile
Find this compound or compounds like it in BindingDB:
Activity Spreadsheet -- Enzyme Inhibition Constant Data from BindingDB
Found 3 hits for monomerid = 362837
TargetTyrosine-protein kinase receptor UFO(Homo sapiens (Human))
Incyte
US Patent
LigandPNGBDBM362837(5-(trans-4-Aminocyclohexyl)-N-butyl-8-{[(tetrahydr...)
Affinity DataIC50:  550nM. Assay description: The assay buffer contained 50 mM HEPES, pH7.5, 10 mM MgCl2, 1 mM EGTA, 0.01% NP-40 and 2 mM DTT. 0.5 ul test compounds dissolved in DMSO were transfe...
Ligand InfoPC cidPC sid
In DepthDetails US Patent
TargetTyrosine-protein kinase receptor TYRO3(Homo sapiens (Human))
Incyte
US Patent
LigandPNGBDBM362837(5-(trans-4-Aminocyclohexyl)-N-butyl-8-{[(tetrahydr...)
Affinity DataIC50: <100nM. Assay description: The assay buffer contained 50 mM HEPES, pH7.5, 10 mM MgCl2, 1 mM EGTA, 0.01% NP-40 and 2 mM DTT. 0.5 ul test compounds dissolved in DMSO were transfe...
Ligand InfoPC cidPC sid
In DepthDetails US Patent
TargetTyrosine-protein kinase Mer(Homo sapiens (Human))
Incyte
US Patent
LigandPNGBDBM362837(5-(trans-4-Aminocyclohexyl)-N-butyl-8-{[(tetrahydr...)
Affinity DataIC50: <100nM. Assay description: The assay buffer contained 50 mM HEPES, pH7.5, 10 mM MgCl2, 1 mM EGTA, 0.01% NP-40 and 2 mM DTT. 0.5 ul test compounds dissolved in DMSO were transfe...
Ligand InfoPC cidPC sid
In DepthDetails US Patent