BDBM362885 US9845308, Example 11d
SMILES CCS(=O)(=O)c1ccc(CNC(=O)c2ccc3[C@@H](C(C)C)N(CC4CC[C@](O)(CC4)C(F)(F)F)Cc3c2)nc1
InChI Key InChIKey=HXPBXEJCHSNQDY-PYRUFZCBSA-N
Data  1 KI
  Tab Delimited (TSV)   2D SDfile   Computed 3D by Vconf -m prep SDfile
Find this compound or compounds like it in BindingDB:
Activity Spreadsheet -- Enzyme Inhibition Constant Data from BindingDB
Found 1 hit for monomerid = 362885
TargetNuclear receptor ROR-gamma(Homo sapiens (Human))
Vitae Pharmaceuticals
US Patent
LigandPNGBDBM362885(US9845308, Example 11d)
Affinity DataKi: >1.00E+3nM. Assay description: Compounds of the present invention were tested for ability to bind to RORγ in a cell-free competition assay with commercially available radio-li...
Ligand InfoPC cidPC sid
In DepthDetails US Patent