BDBM363026 3-((6-Chloro-7-fluoro-2-methyl-1-(2-oxo-2-(spiro[cyclopropane-1,3′-indolin]-1′-yl)ethyl)-1H-indol-3-yl)thio)-2-fluorobenzoic acid ::US9850203, Compound 2-55
SMILES CCOC(=O)c1cccc(Sc2c(C)n(CC(=O)N3CC4(CC4)c4ccccc34)c3c(F)c(Cl)ccc23)c1F
InChI Key InChIKey=TWXMRRDZFHNKAW-UHFFFAOYSA-N
Data  1 IC50
  Tab Delimited (TSV)   2D SDfile   Computed 3D by Vconf -m prep SDfile
Find this compound or compounds like it in BindingDB:
Activity Spreadsheet -- Enzyme Inhibition Constant Data from BindingDB
Found 1 hit for monomerid = 363026
TargetEctonucleotide pyrophosphatase/phosphodiesterase family member 2(Homo sapiens (Human))
Pharmakea
US Patent
LigandPNGBDBM363026(3-((6-Chloro-7-fluoro-2-methyl-1-(2-oxo-2-(spiro[c...)
Affinity DataIC50: <500nM. Assay description: ATX activity is assayed in concentrated conditioned media from Hep3B human hepatocellular carcinoma cells by measuring the amount of choline released...
Ligand InfoPC cidPC sid
In DepthDetails US Patent