BDBM363046 3-((6-Chloro-7-fluoro-2-methyl-1-(2-(spiro[cyclobutane-1,3′-indolin]-1′-yl)ethyl)-1H-indol-3-yl)thio)-2-fluorobenzoic acid ::US9850203, Compound 2-75
SMILES Cc1c(Sc2cccc(C(O)=O)c2F)c2ccc(Cl)c(F)c2n1CCN1CC2(CCC2)c2ccccc12
InChI Key InChIKey=BCYDSOYLRVGAKU-UHFFFAOYSA-N
Data  1 IC50
  Tab Delimited (TSV)   2D SDfile   Computed 3D by Vconf -m prep SDfile
Find this compound or compounds like it in BindingDB:
Activity Spreadsheet -- Enzyme Inhibition Constant Data from BindingDB
Found 1 hit for monomerid = 363046
TargetEctonucleotide pyrophosphatase/phosphodiesterase family member 2(Homo sapiens (Human))
Pharmakea
US Patent
LigandPNGBDBM363046(3-((6-Chloro-7-fluoro-2-methyl-1-(2-(spiro[cyclobu...)
Affinity DataIC50: <500nM. Assay description: ATX activity is assayed in concentrated conditioned media from Hep3B human hepatocellular carcinoma cells by measuring the amount of choline released...
Ligand InfoPC cidPC sid
In DepthDetails US Patent