BDBM364140 US9856252, 32
SMILES CC(C)(C)OC(=O)N1CCC(CC1)Nc1ccc2nc([nH]c2n1)-c1ccc(OCc2ccccc2)cc1
InChI Key InChIKey=LAOLVIKHRFUIHZ-UHFFFAOYSA-N
Data  1 IC50
  Tab Delimited (TSV)   2D SDfile   Computed 3D by Vconf -m prep SDfile
Find this compound or compounds like it in BindingDB:
Activity Spreadsheet -- Enzyme Inhibition Constant Data from BindingDB
Found 1 hit for monomerid = 364140
TargetProtein arginine N-methyltransferase 5(Homo sapiens (Human))
Cancer Therapeutics Crc
US Patent
LigandPNGBDBM364140(US9856252, 32)
Affinity DataIC50:  827nM. Assay description: The 6 μL assay reactions are run in Greiner brand black 384-well low volume plates. All reactions contained assay buffer (phosphate buffered sal...
Ligand InfoPC cidPC sid
In DepthDetails US Patent