BDBM36416 3,4-Difluoro-N-(2-(4-(2-oxo-2,3-dihydro-1H-benzo[d]imidazol-1-yl)piperidin-1-yl)ethyl)benzamide, 47::CID25105698
SMILES Fc1ccc(cc1F)C(=O)NCCN1CCC(CC1)n1c2ccccc2[nH]c1=O
InChI Key InChIKey=VQDSYSHRRXTEOA-UHFFFAOYSA-N
Data  3 IC50  2 EC50
  Tab Delimited (TSV)   2D SDfile   Computed 3D by Vconf -m prep SDfile
Find this compound or compounds like it in BindingDB:
Activity Spreadsheet -- Enzyme Inhibition Constant Data from BindingDB
Found 5 hits for monomerid = 36416
TargetPhospholipase D1(Homo sapiens (Human))
Vanderbilt University
LigandPNGBDBM36416(3,4-Difluoro-N-(2-(4-(2-oxo-2,3-dihydro-1H-benzo[d...)
Affinity DataIC50:  480nMT: 2°C. Assay description: PLD in vitro enzymatic assay using phospholipase D1(PLD1).
In DepthDetails ArticlePubMed
TargetPhospholipase D1(Homo sapiens (Human))
Vanderbilt University
LigandPNGBDBM36416(3,4-Difluoro-N-(2-(4-(2-oxo-2,3-dihydro-1H-benzo[d...)
Affinity DataIC50:  560nMT: 2°C. Assay description: PLD in vitro enzymatic assay using phospholipase D2(PLD2).
In DepthDetails ArticlePubMed
TargetPhospholipase D1(Homo sapiens (Human))
Vanderbilt University
LigandPNGBDBM36416(3,4-Difluoro-N-(2-(4-(2-oxo-2,3-dihydro-1H-benzo[d...)
Affinity DataEC50:  130nMT: 2°C. Assay description: cell-based assay using HEK293-gfpPLD2 cell line
In DepthDetails ArticlePubMed
TargetPhospholipase D1(Homo sapiens (Human))
Vanderbilt University
LigandPNGBDBM36416(3,4-Difluoro-N-(2-(4-(2-oxo-2,3-dihydro-1H-benzo[d...)
Affinity DataEC50:  17nMT: 2°C. Assay description: cell-based assay using human non-small-cell lung cancer cell line, Calu-1
In DepthDetails ArticlePubMed
TargetPhospholipase D1(Homo sapiens (Human))
Vanderbilt University
LigandPNGBDBM36416(3,4-Difluoro-N-(2-(4-(2-oxo-2,3-dihydro-1H-benzo[d...)
Affinity DataIC50:  5.00E+3nMT: 2°C. Assay description: Phopholipase D1(PLD)enzymatic inhibition assay using PLD1.d311
In DepthDetails ArticlePubMed