BDBM365706 US9868748, I-C10
SMILES CCS(=O)(=O)c1ccc(CC(=O)Nc2nc3[C@@H](C(C)C)N(Cc4ccc(C#N)c(Cl)c4)Cc3s2)nc1
InChI Key InChIKey=XSXHKFPZANXGOS-XMMPIXPASA-N
Data  1 KI
  Tab Delimited (TSV)   2D SDfile   Computed 3D by Vconf -m prep SDfile
Find this compound or compounds like it in BindingDB:
Activity Spreadsheet -- Enzyme Inhibition Constant Data from BindingDB
Found 1 hit for monomerid = 365706
TargetNuclear receptor ROR-gamma(Homo sapiens (Human))
Vitae Pharmaceuticals
US Patent
LigandPNGBDBM365706(US9868748, I-C10)
Affinity DataKi: <100nM. Assay description: Compounds of the present invention were tested for ability to bind to RORγ in a cell-free competition assay with commercially available radio-li...
Ligand InfoPC cidPC sid
In DepthDetails US Patent