BDBM370463 2-(8-chloro-5H-imidazo[5,1-a]isoindol-5-yl)-1- cyclohexylethanol;::US10233190, Example 1374
SMILES OC(CC1c2ccc(Cl)cc2-c2cncn12)C1CCCCC1
InChI Key InChIKey=QGHQVXDKDPJMIN-UHFFFAOYSA-N
Data  2 IC50  1 EC50
  Tab Delimited (TSV)   2D SDfile   Computed 3D by Vconf -m prep SDfile
Find this compound or compounds like it in BindingDB:
Activity Spreadsheet -- Enzyme Inhibition Constant Data from BindingDB
Found 3 hits for monomerid = 370463
TargetIndoleamine 2,3-dioxygenase 1(Homo sapiens (Human))
Newlink Genetics
US Patent
LigandPNGBDBM370463(2-(8-chloro-5H-imidazo[5,1-a]isoindol-5-yl)-1- cyc...)
Affinity DataIC50:  550nM. Assay description: The IC50 values for each compound were determined by testing the activity of IDO in a mixture containing 50 mM potassium phosphate buffer at pH 6.5; ...
Ligand InfoKEGGPC cidPC sid
In DepthDetails US Patent
TargetIndoleamine 2,3-dioxygenase 1(Homo sapiens (Human))
Newlink Genetics
US Patent
LigandPNGBDBM370463(2-(8-chloro-5H-imidazo[5,1-a]isoindol-5-yl)-1- cyc...)
Affinity DataEC50:  5.40E+3nM. Assay description: Inhibition of recombinant human IDO1 expressed in T-REx-293 cells assessed as reduction in kynurenine level measured after 16 hrs
Ligand InfoKEGGPC cidPC sid
In DepthDetails ArticlePubMed
TargetIndoleamine 2,3-dioxygenase 1(Homo sapiens (Human))
Newlink Genetics
US Patent
LigandPNGBDBM370463(2-(8-chloro-5H-imidazo[5,1-a]isoindol-5-yl)-1- cyc...)
Affinity DataIC50:  6.90E+3nM. Assay description: Inhibition of purified human IDO1 using L-tryptophan as substrate preincubated for 5 mins followed by substrate addition and measured after 15 mins b...
Ligand InfoKEGGPC cidPC sid
In DepthDetails ArticlePubMed