BDBM372416 US10245275, Compound A
SMILES CC(=C)[C@@H]1CC[C@@]2(CC[C@]3(C)[C@H](CC[C@@H]4[C@@]5(C)CC=C(C6=CCC(F)(CC6)OC=O)C(C)(C)[C@@H]5CC[C@@]34C)[C@@H]12)NCCN1CCC(CC1)S(C)(=O)=O
InChI Key InChIKey=JYUYNYIEQYKVCM-AOMVPLBISA-N
Data  2 EC50
  Tab Delimited (TSV)   2D SDfile   Computed 3D by Vconf -m prep SDfile
Find this compound or compounds like it in BindingDB:
Activity Spreadsheet -- Enzyme Inhibition Constant Data from BindingDB
Found 2 hits for monomerid = 372416
TargetGag-Pol polyprotein [A364V](Human immunodeficiency virus type 1 group M subtyp...)
Viiv Healthcare UK (No. 4)
US Patent
LigandPNGBDBM372416(US10245275, Compound A)
Affinity DataEC50:  1.50E+3nM. Assay description: MT-2 cells and 293T cells were obtained from the NIH AIDS Research and Reference Reagent Program. MT-2 cells were propagated in RPMI 1640 media suppl...
Ligand InfoPC cidPC sid
In DepthDetails US Patent
TargetGag-Pol polyprotein(Human immunodeficiency virus type 1 group M subtyp...)
Viiv Healthcare UK (No. 4)
US Patent
LigandPNGBDBM372416(US10245275, Compound A)
Affinity DataEC50:  4nM. Assay description: MT-2 cells and 293T cells were obtained from the NIH AIDS Research and Reference Reagent Program. MT-2 cells were propagated in RPMI 1640 media suppl...
Ligand InfoPC cidPC sid
In DepthDetails US Patent