BDBM37299 MLS000087085::N-[1-(4-chlorobenzyl)-5-methyl-1H-pyrazol-3-yl]-5-(3-methoxyphenyl)isoxazole-3-carboxamide::N-[1-(4-chlorobenzyl)-5-methyl-pyrazol-3-yl]-5-(3-methoxyphenyl)isoxazole-3-carboxamide::N-[1-[(4-chlorophenyl)methyl]-5-methyl-3-pyrazolyl]-5-(3-methoxyphenyl)-3-isoxazolecarboxamide::N-[1-[(4-chlorophenyl)methyl]-5-methyl-pyrazol-3-yl]-5-(3-methoxyphenyl)-1,2-oxazole-3-carboxamide::N-[1-[(4-chlorophenyl)methyl]-5-methylpyrazol-3-yl]-5-(3-methoxyphenyl)-1,2-oxazole-3-carboxamide::SMR000023308::cid_3241972
SMILES COc1cccc(c1)-c1cc(no1)C(=O)Nc1cc(C)n(Cc2ccc(Cl)cc2)n1
InChI Key InChIKey=UWPLXONGQBKBLY-UHFFFAOYSA-N
Data  6 IC50
  Tab Delimited (TSV)   2D SDfile   Computed 3D by Vconf -m prep SDfile
Find this compound or compounds like it in BindingDB:
Activity Spreadsheet -- Enzyme Inhibition Constant Data from BindingDB
Found 6 hits for monomerid = 37299
TargetPantothenate synthetase(Mycobacterium tuberculosis (strain ATCC 25618 / H3...)
Srmlsc
Curated by PubChem BioAssay
LigandPNGBDBM37299(MLS000087085 | N-[1-(4-chlorobenzyl)-5-methyl-1H-p...)
Affinity DataIC50: >1.00E+5nM. Assay description: Southern Research Molecular Libraries Screening Center (SRMLSC) Southern Research Institute (Birmingham, Alabama) NIH Molecular Libraries Screening C...
In DepthDetails PCBioAssay
TargetPantothenate synthetase(Mycobacterium tuberculosis (strain ATCC 25618 / H3...)
Srmlsc
Curated by PubChem BioAssay
LigandPNGBDBM37299(MLS000087085 | N-[1-(4-chlorobenzyl)-5-methyl-1H-p...)
Affinity DataIC50: >1.00E+5nM. Assay description: Southern Research Molecular Libraries Screening Center (SRMLSC) Southern Research Institute (Birmingham, Alabama) NIH Molecular Libraries Screening C...
In DepthDetails PCBioAssay
TargetPantothenate synthetase(Mycobacterium tuberculosis (strain ATCC 25618 / H3...)
Srmlsc
Curated by PubChem BioAssay
LigandPNGBDBM37299(MLS000087085 | N-[1-(4-chlorobenzyl)-5-methyl-1H-p...)
Affinity DataIC50: >1.00E+5nM. Assay description: Southern Research Molecular Libraries Screening Center (SRMLSC) Southern Research Institute (Birmingham, Alabama) NIH Molecular Libraries Screening C...
In DepthDetails PCBioAssay
TargetPantothenate synthetase(Mycobacterium tuberculosis (strain ATCC 25618 / H3...)
Srmlsc
Curated by PubChem BioAssay
LigandPNGBDBM37299(MLS000087085 | N-[1-(4-chlorobenzyl)-5-methyl-1H-p...)
Affinity DataIC50: >1.00E+5nM. Assay description: Southern Research Molecular Libraries Screening Center (SRMLSC) Southern Research Institute (Birmingham, Alabama) NIH Molecular Libraries Screening C...
In DepthDetails PCBioAssay
TargetPantothenate synthetase(Mycobacterium tuberculosis (strain ATCC 25618 / H3...)
Srmlsc
Curated by PubChem BioAssay
LigandPNGBDBM37299(MLS000087085 | N-[1-(4-chlorobenzyl)-5-methyl-1H-p...)
Affinity DataIC50: >1.00E+5nM. Assay description: Southern Research Molecular Libraries Screening Center (SRMLSC) Southern Research Institute (Birmingham, Alabama) NIH Molecular Libraries Screening C...
In DepthDetails PCBioAssay
TargetPantothenate synthetase(Mycobacterium tuberculosis (strain ATCC 25618 / H3...)
Srmlsc
Curated by PubChem BioAssay
LigandPNGBDBM37299(MLS000087085 | N-[1-(4-chlorobenzyl)-5-methyl-1H-p...)
Affinity DataIC50: >1.00E+5nM. Assay description: Southern Research Molecular Libraries Screening Center (SRMLSC) Southern Research Institute (Birmingham, Alabama) NIH Molecular Libraries Screening C...
In DepthDetails PCBioAssay