BDBM374690 3-((S)-1-((1S,6R)-4-(1-((R)-1-(2,4-Dichlorophenyl)ethyl)-3-methyl-1H-pyrazolo[3,4-b]pyrazin-6-yl)-6-methylcyclohex-3-en-1-yl)pyrrolidin-2-yl)propanoic acid hydrochloride::US10246462, Example 71::US10246462, Example 72::US10246462, Example 77
SMILES C[C@H](c1ccc(Cl)cc1Cl)n1nc(C)c2ncc(nc12)C1=CCC([C@H](C)C1)N1CCC[C@H]1CCC(O)=O
InChI Key InChIKey=BTIYILIGTINKCG-GAIYTWNRSA-N
Data  3 IC50
  Tab Delimited (TSV)   2D SDfile   Computed 3D by Vconf -m prep SDfile
Find this compound or compounds like it in BindingDB:
Activity Spreadsheet -- Enzyme Inhibition Constant Data from BindingDB
Found 3 hits for monomerid = 374690
TargetC-C chemokine receptor type 4(Homo sapiens (Human))
Flx Bio
US Patent
LigandPNGBDBM374690(3-((S)-1-((1S,6R)-4-(1-((R)-1-(2,4-Dichlorophenyl)...)
Affinity DataIC50: <100nM. Assay description: To measure binding of 125I-TARC or 125I-MDC to cells expressing CCR4 (e.g., CEM cells (e.g., ATCC HB-12624)), the 125I-TARC or 125I-MDC is diluted to...
Ligand InfoPC cidPC sid
In DepthDetails US Patent
TargetC-C chemokine receptor type 4(Homo sapiens (Human))
Flx Bio
US Patent
LigandPNGBDBM374690(3-((S)-1-((1S,6R)-4-(1-((R)-1-(2,4-Dichlorophenyl)...)
Affinity DataIC50: <100nM. Assay description: To measure binding of 125I-TARC or 125I-MDC to cells expressing CCR4 (e.g., CEM cells (e.g., ATCC HB-12624)), the 125I-TARC or 125I-MDC is diluted to...
Ligand InfoPC cidPC sid
In DepthDetails US Patent
TargetC-C chemokine receptor type 4(Homo sapiens (Human))
Flx Bio
US Patent
LigandPNGBDBM374690(3-((S)-1-((1S,6R)-4-(1-((R)-1-(2,4-Dichlorophenyl)...)
Affinity DataIC50: >500nM. Assay description: To measure binding of 125I-TARC or 125I-MDC to cells expressing CCR4 (e.g., CEM cells (e.g., ATCC HB-12624)), the 125I-TARC or 125I-MDC is diluted to...
Ligand InfoPC cidPC sid
In DepthDetails US Patent