BDBM37721 2-(3-chlorophenyl)-4-N-methyltriazole-4,5-diamine::2-(3-chlorophenyl)-N-methyl-2H-1,2,3-triazole-4,5-diamine::2-(3-chlorophenyl)-N4-methyl-1,2,3-triazole-4,5-diamine::2-(3-chlorophenyl)-N4-methyltriazole-4,5-diamine::MLS000091276::SMR000025838::[5-amino-2-(3-chlorophenyl)triazol-4-yl]-methyl-amine::cid_3240793
SMILES CNc1nn(nc1N)-c1cccc(Cl)c1
InChI Key InChIKey=UDYXQSKRAZKRDP-UHFFFAOYSA-N
Data  2 KI  4 IC50  2 EC50
  Tab Delimited (TSV)   2D SDfile   Computed 3D by Vconf -m prep SDfile
Find this compound or compounds like it in BindingDB:
Activity Spreadsheet -- Enzyme Inhibition Constant Data from BindingDB
Found 8 hits for monomerid = 37721
TargetN-formyl peptide receptor 2(Homo sapiens (Human))
Nmmlsc
Curated by PubChem BioAssay
LigandPNGBDBM37721(2-(3-chlorophenyl)-4-N-methyltriazole-4,5-diamine ...)
Affinity DataKi:  1.10E+4nM. Assay description: University of New Mexico Assay Overview Assay Support: NIH 1R03MH076381-01 Assay for Formylpeptide Receptor Family Ligands PI: Bruce S. Edwards, Ph....
Ligand InfoPC cidPC sid
In DepthDetails PCBioAssay
TargetfMet-Leu-Phe receptor(Homo sapiens (Human))
Nmmlsc
Curated by PubChem BioAssay
LigandPNGBDBM37721(2-(3-chlorophenyl)-4-N-methyltriazole-4,5-diamine ...)
Affinity DataKi: >4.37E+4nM. Assay description: University of New Mexico Assay Overview: Assay Support: NIH 1R03MH076381-01 Assay for Formylpeptide Receptor Family Ligands PI: Bruce S. Edwards, Ph...
Ligand InfoPC cidPC sid
In DepthDetails PCBioAssay
TargetD(1A) dopamine receptor(Homo sapiens (Human))
Vanderbilt Screening Center For Gpcrs, Ion Channels and Transporters
Curated by PubChem BioAssay
LigandPNGBDBM37721(2-(3-chlorophenyl)-4-N-methyltriazole-4,5-diamine ...)
Affinity DataEC50:  0.325nM. Assay description: Assay Provider: Val Watts Assay Provider Affiliation: Purdue University Grant Title: Allosteric Modulators of D1 Receptors Grant Number: 1 X01 MH0776...
Ligand InfoPC cidPC sid
In DepthDetails PCBioAssay
TargetLarge T antigen(Simian virus 40)
Southern Research Specialized Biocontainment Screening Center
Curated by PubChem BioAssay
LigandPNGBDBM37721(2-(3-chlorophenyl)-4-N-methyltriazole-4,5-diamine ...)
Affinity DataIC50:  2.99E+4nM. Assay description: A biochemical assay using the ADP-Hunter methodology, purified TAg, and ATP to identify compounds that inhibit the ATPase activity of Tag Southern Re...
Ligand InfoPC cidPC sid
In DepthDetails PCBioAssay
TargetGroup 3 secretory phospholipase A2(Homo sapiens)
The Scripps Research Institute Molecular Screening Center
Curated by PubChem BioAssay
LigandPNGBDBM37721(2-(3-chlorophenyl)-4-N-methyltriazole-4,5-diamine ...)
Affinity DataIC50:  1.22E+5nM. Assay description: Source (MLPCN Center Name): The Scripps Research Institute Molecular Screening Center Affiliation: The Scripps Research Institute, TSRI Assay Provide...
Ligand InfoPC cidPC sid
In DepthDetails PCBioAssay
TargetN-formyl peptide receptor 2(Homo sapiens (Human))
Nmmlsc
Curated by PubChem BioAssay
LigandPNGBDBM37721(2-(3-chlorophenyl)-4-N-methyltriazole-4,5-diamine ...)
Affinity DataIC50:  1.82E+4nM. Assay description: University of New Mexico Assay Overview Assay Support: NIH 1R03MH076381-01 Assay for Formylpeptide Receptor Family Ligands PI: Bruce S. Edwards, Ph....
Ligand InfoPC cidPC sid
In DepthDetails PCBioAssay
TargetfMet-Leu-Phe receptor(Homo sapiens (Human))
Nmmlsc
Curated by PubChem BioAssay
LigandPNGBDBM37721(2-(3-chlorophenyl)-4-N-methyltriazole-4,5-diamine ...)
Affinity DataIC50: >6.67E+4nM. Assay description: University of New Mexico Assay Overview: Assay Support: NIH 1R03MH076381-01 Assay for Formylpeptide Receptor Family Ligands PI: Bruce S. Edwards, Ph...
Ligand InfoPC cidPC sid
In DepthDetails PCBioAssay
TargetD(1B) dopamine receptor(Homo sapiens (Human))
Vanderbilt Screening Center For Gpcrs, Ion Channels and Transporters
Curated by PubChem BioAssay
LigandPNGBDBM37721(2-(3-chlorophenyl)-4-N-methyltriazole-4,5-diamine ...)
Affinity DataEC50:  0.0151nM. Assay description: Assay Provider: Val Watts Assay Provider Affiliation: Purdue University Grant Title: Allosteric Modulators of D1 Receptors Grant Number: 1 X01 MH0776...
Ligand InfoPC cidPC sid
In DepthDetails PCBioAssay