BDBM377321 US10265310, Example 75::rac-trans-1-(4-chlorophenyl)-3-(4-(4-(methylsulfonyl)phenyl)-6-oxopiperidin-3-yl)urea
SMILES CS(=O)(=O)c1ccc(cc1)[C@H]1CC(=O)NC[C@@H]1NC(=O)Nc1ccc(Cl)cc1
InChI Key InChIKey=QBSAYROUDLKNOI-SJORKVTESA-N
Data  2 EC50
  Tab Delimited (TSV)   2D SDfile   Computed 3D by Vconf -m prep SDfile
Find this compound or compounds like it in BindingDB:
Activity Spreadsheet -- Enzyme Inhibition Constant Data from BindingDB
Found 2 hits for monomerid = 377321
TargetfMet-Leu-Phe receptor(Homo sapiens (Human))
GrÜNenthal
US Patent
LigandPNGBDBM377321(US10265310, Example 75 | rac-trans-1-(4-chlorophen...)
Affinity DataEC50:  500nM. Assay description: Cryo-vial containing 6×106 cells (hFPR1-Gα15-CHO or hFPR2-Aq-CHO) was thawed in a 37° C. water bath. Cells were suspended in 10 ml of respective...
Ligand InfoPC cidPC sid
In DepthDetails US Patent
TargetN-formyl peptide receptor 2(Homo sapiens (Human))
GrÜNenthal
US Patent
LigandPNGBDBM377321(US10265310, Example 75 | rac-trans-1-(4-chlorophen...)
Affinity DataEC50:  500nM. Assay description: Cryo-vial containing 6×106 cells (hFPR1-Gα15-CHO or hFPR2-Aq-CHO) was thawed in a 37° C. water bath. Cells were suspended in 10 ml of respective...
Ligand InfoPC cidPC sid
In DepthDetails US Patent