BDBM377860 5-amino-3-{4-[(5-chloro-3-fluoropyridin-2-yl)oxy]phenyl}-1-{(3R)-1-[(2E)-4-hydroxybut-2-enoyl]piperidin-3-yl}-1H-pyrazole-4-carboxamide::US10266513, Example 154
SMILES NC(=O)c1c(N)n(nc1-c1ccc(Oc2ncc(Cl)cc2F)cc1)C1CCCN(C1)C(=O)\C=C\CO
InChI Key InChIKey=FBWVTHAXPPZBGA-DUXPYHPUSA-N
Data  1 IC50
  Tab Delimited (TSV)   2D SDfile   Computed 3D by Vconf -m prep SDfile
Find this compound or compounds like it in BindingDB:
Activity Spreadsheet -- Enzyme Inhibition Constant Data from BindingDB
Found 1 hit for monomerid = 377860
TargetTyrosine-protein kinase BTK(Homo sapiens (Human))
Pfizer
US Patent
LigandPNGBDBM377860(5-amino-3-{4-[(5-chloro-3-fluoropyridin-2-yl)oxy]p...)
Affinity DataIC50:  49nM. Assay description: TR-FRET LanthaScreen assays were performed by incubating a dilution series of inhibitor concentrations with 50 μM ATP, 100 nM FAM-Srctide peptid...
Ligand InfoPC cidPC sid
In DepthDetails US Patent