BDBM382801 US10273259, Example 512::US10711020, Example 512
SMILES C[C@@]1(CC[C@@H](CC1)C(O)=O)C(=O)N1CCC2(C1CNc1cc(ccc21)C(F)(C(F)(F)F)C(F)(F)F)S(=O)(=O)c1ccc(F)cc1
InChI Key InChIKey=UKOMWKQXEVTTJY-FVSSTLBOSA-N
Data  2 IC50
  Tab Delimited (TSV)   2D SDfile   Computed 3D by Vconf -m prep SDfile
Find this compound or compounds like it in BindingDB:
Activity Spreadsheet -- Enzyme Inhibition Constant Data from BindingDB
Found 2 hits for monomerid = 382801
TargetNuclear receptor ROR-gamma [262-507](Homo sapiens (Human))
Bristol-Myers Squibb
US Patent
LigandPNGBDBM382801(US10273259, Example 512 | US10711020, Example 512)
Affinity DataIC50:  22nM. Assay description: The binding of potential ligands to RORγ is measured by competition with [3H]25-hydroxycholesterol (Perkin Elmer NET674250UC) using a scintillat...
Ligand InfoPC cidPC sid
In DepthDetails US Patent
TargetNuclear receptor ROR-gamma(Mus musculus)
Bristol-Myers Squibb
US Patent
LigandPNGBDBM382801(US10273259, Example 512 | US10711020, Example 512)
Affinity DataIC50:  22nM. Assay description: The binding of potential ligands to RORγ is measured by competition with [3H]25-hydroxycholesterol (Perkin Elmer NET674250UC) using a scintillat...
Ligand InfoPC cidPC sid
In DepthDetails US Patent