BDBM385404 4-((R or S)-6-(3-(4H- 1,2,4-triazol-3- yl)azetidine-1- carbonyl)-1-(2-chloro- 6-cyclopropylbenzoyl)- 4,5,6,7-tetrahydro-1H- indazol-3-yl)cyclohex- 3-ene-1-carboxylic acid::US10287272, Example 2M::US10689369, Example 2M
SMILES OC(=O)C1CCC(=CC1)c1nn(C(=O)c2c(Cl)cccc2C2CC2)c2CC(CCc12)C(=O)N1CC(C1)c1nnc[nH]1
InChI Key
Data  2 IC50
  Tab Delimited (TSV)   2D SDfile   Computed 3D by Vconf -m prep SDfile
Find this compound or compounds like it in BindingDB:
Activity Spreadsheet -- Enzyme Inhibition Constant Data from BindingDB
Found 2 hits for monomerid = 385404
TargetNuclear receptor ROR-gamma(Homo sapiens (Human))
Merck Sharp & Dohme
US Patent
LigandPNGBDBM385404(4-((R or S)-6-(3-(4H- 1,2,4-triazol-3- yl)azetidin...)
Affinity DataIC50:  2nM. Assay description: The compounds of the invention inhibit RORgammaT activity. Activation of RORgammaT activity can be measured using, e.g., biochemical TR-FRET assay. I...
Ligand InfoPC cidPC sid
In DepthDetails US Patent
TargetNuclear receptor ROR-gamma(Homo sapiens (Human))
Merck Sharp & Dohme
US Patent
LigandPNGBDBM385404(4-((R or S)-6-(3-(4H- 1,2,4-triazol-3- yl)azetidin...)
Affinity DataIC50:  2nM. Assay description: To identify novel antagonists of RORgammaT, an assay was developed which employs the interaction of RORgammaT with its co-activator peptide SRC1_2. T...
Ligand InfoPC cidPC sid
In DepthDetails US Patent