BDBM385583 US10287279, Compound 25
SMILES C=CCNC1OC(=NC1C#N)c1cccc2ccccc12
InChI Key InChIKey=HSNRBKHDUAGJTC-UHFFFAOYSA-N
Data  1 IC50
  Tab Delimited (TSV)   2D SDfile   Computed 3D by Vconf -m prep SDfile
Find this compound or compounds like it in BindingDB:
Activity Spreadsheet -- Enzyme Inhibition Constant Data from BindingDB
Found 1 hit for monomerid = 385583
TargetPolyunsaturated fatty acid lipoxygenase ALOX15(Homo sapiens (Human))
The Children'S Hospital
US Patent
LigandPNGBDBM385583(US10287279, Compound 25)
Affinity DataIC50:  3.00E+3nM. Assay description: The inhibitor compounds were screened initially using one concentration point on a Perkin-Elmer Lambda 40 UV-Vis spectrometer. The percent inhibition...
Ligand InfoPC cidPC sid
In DepthDetails US Patent