BDBM391683 3-{[1-ethyl-4-({[(1R,2S)-2-phenylcyclopropyl]amino}methyl)piperidin-4-yl]methyl}benzoic Acid::US10300051, Example 29
SMILES CCN1CCC(CN[C@@H]2CC2c2ccccc2)(Cc2cccc(c2)C(O)=O)CC1
InChI Key InChIKey=ZEUBGPAPTUKOME-OZAIVSQSSA-N
Data  1 IC50
  Tab Delimited (TSV)   2D SDfile   Computed 3D by Vconf -m prep SDfile
Find this compound or compounds like it in BindingDB:
Activity Spreadsheet -- Enzyme Inhibition Constant Data from BindingDB
Found 1 hit for monomerid = 391683
TargetLysine-specific histone demethylase 1A(Homo sapiens (Human))
Incyte
US Patent
LigandPNGBDBM391683(3-{[1-ethyl-4-({[(1R,2S)-2-phenylcyclopropyl]amino...)
Affinity DataIC50: <100nM. Assay description: LANCE LSD1/KDM1A demethylase assay—10 μL of 1 nM LSD-1 enzyme (ENZO BML-SE544-0050) in the assay buffer (50 mM Tris, pH 7.5, 0.01% Tween-20, 25 ...
Ligand InfoPC cidPC sid
In DepthDetails US Patent