BDBM393455 1-(10-methyl- 3,4- dihydro- pyrazino[1,2- a]indol- 2(1H)-yl)-2- (piperidin-1- yl)ethanone::US9963453, 14
SMILES Cc1c2CN(CCn2c2ccccc12)C(=O)CN1CCCCC1
InChI Key InChIKey=MPCWQWUOWLVGAN-UHFFFAOYSA-N
Data  1 KI
  Tab Delimited (TSV)   2D SDfile   Computed 3D by Vconf -m prep SDfile
Find this compound or compounds like it in BindingDB:
Activity Spreadsheet -- Enzyme Inhibition Constant Data from BindingDB
Found 1 hit for monomerid = 393455
TargetSigma non-opioid intracellular receptor 1(Homo sapiens (Human))
Laboratorios Del Dr. Esteve
US Patent
LigandPNGBDBM393455(1-(10-methyl- 3,4- dihydro- pyrazino[1,2- a]indol-...)
Affinity DataKi:  24nM. Assay description: To investigate binding properties of sigma 1 receptor ligands to human sigma 1 receptor, transfected HEK-293 membranes and [3H](+)-pentazocine (Perki...
Ligand InfoPC cidPC sid
In DepthDetails US Patent