BDBM394427 (trans-4a,8a)-2-(3-amino-6-::US10308614, Example 28::US10308614, Example 84
SMILES Nc1nnc(cc1N1CC[C@@]2(O)CCCC[C@@H]2C1)-c1ccccc1O
InChI Key InChIKey=CIYLCQZYHHBUOV-YJYMSZOUSA-N
Data  2 IC50
  Tab Delimited (TSV)   2D SDfile   Computed 3D by Vconf -m prep SDfile
Find this compound or compounds like it in BindingDB:
Activity Spreadsheet -- Enzyme Inhibition Constant Data from BindingDB
Found 2 hits for monomerid = 394427
TargetTranscription activator BRG1 [1448-1575](Homo sapiens (Human))
Genentech
US Patent
LigandPNGBDBM394427((trans-4a,8a)-2-(3-amino-6- | US10308614, Example ...)
Affinity DataIC50:  8.40nM. Assay description: His-BRG1 (A1448-S1575; Swiss Prot P51532; mhhhhhhgslvpr\gsAEKLSPNPP NLTKKMKKIVDAVIKYKDSSSGRQLSEVFIQLPSRKELPEYYELIRKPVDFKKIKERIRNH KYRSLNDLEKDVMLLCQNA...
Ligand InfoPC cidPC sid
In DepthDetails US Patent
TargetTranscription activator BRG1 [1448-1575](Homo sapiens (Human))
Genentech
US Patent
LigandPNGBDBM394427((trans-4a,8a)-2-(3-amino-6- | US10308614, Example ...)
Affinity DataIC50:  17.2nM. Assay description: His-BRG1 (A1448-S1575; Swiss Prot P51532; mhhhhhhgslvpr\gsAEKLSPNPP NLTKKMKKIVDAVIKYKDSSSGRQLSEVFIQLPSRKELPEYYELIRKPVDFKKIKERIRNH KYRSLNDLEKDVMLLCQNA...
Ligand InfoPC cidPC sid
In DepthDetails US Patent