BDBM397193 US10596172, Compound I-131::US10828300, Compound I-131::US11351168, Compound I-131::US9987276, Compound I-131
SMILES COCCOc1ccc(Nc2ncc(C3CC3)c(Oc3cccc(NC(=O)C=C)c3)n2)cc1
InChI Key InChIKey=YXOFPAPRVJJCKX-UHFFFAOYSA-N
Data  12 IC50
  Tab Delimited (TSV)   2D SDfile   Computed 3D by Vconf -m prep SDfile
Find this compound or compounds like it in BindingDB:
Activity Spreadsheet -- Enzyme Inhibition Constant Data from BindingDB
Found 12 hits for monomerid = 397193
TargetCytoplasmic tyrosine-protein kinase BMX(Homo sapiens (Human))
Celgene Car
US Patent
LigandPNGBDBM397193(US10596172, Compound I-131 | US10828300, Compound ...)
Affinity DataIC50: <10nM. Assay description: BMX: The activity of selected compounds of this invention in the BMX inhibition assay
Ligand InfoPC cidPC sid
In DepthDetails US Patent
TargetEpidermal growth factor receptor(Homo sapiens (Human))
Celgene Car
US Patent
LigandPNGBDBM397193(US10596172, Compound I-131 | US10828300, Compound ...)
Affinity DataIC50: <10nM. Assay description: EGFR (WT) and EGFR (T790M/L858R): The Omnia Assay Protocol for potency assessment against EGFR is performed as described in Example 251 above except ...
Ligand InfoPC cidPC sid
In DepthDetails US Patent
TargetTyrosine-protein kinase ITK/TSK(Homo sapiens (Human))
Celgene Car
US Patent
LigandPNGBDBM397193(US10596172, Compound I-131 | US10828300, Compound ...)
Affinity DataIC50: <10nM. Assay description: ITK: This example describes continuous-read kinase assays to measure inherent potency of compound against active forms of ITK enzymes as described in...
Ligand InfoPC cidPC sid
In DepthDetails US Patent
TargetTyrosine-protein kinase BTK(Homo sapiens (Human))
Celgene Car
US Patent
LigandPNGBDBM397193(US10596172, Compound I-131 | US10828300, Compound ...)
Affinity DataIC50: <10nM. Assay description: Briefly, 10× stocks of EGFR-WT (PV3872) from Invitrogen and EGFR-T790M/L858R (40350) from BPS Bioscience, San Diego, Calif., 1.13×ATP (AS001A) and ap...
Ligand InfoPC cidPC sid
In DepthDetails US Patent
TargetTyrosine-protein kinase ITK/TSK(Homo sapiens (Human))
Celgene Car
US Patent
LigandPNGBDBM397193(US10596172, Compound I-131 | US10828300, Compound ...)
Affinity DataIC50: <10nM. Assay description: Briefly, 10× stocks of EGFR-WT (PV3872) from Invitrogen and EGFR-T790M/L858R (40350) from BPS Bioscience, San Diego, Calif., 1.13×ATP (AS001A) and ap...
Ligand InfoPC cidPC sid
In DepthDetails US Patent
TargetEpidermal growth factor receptor(Homo sapiens (Human))
Celgene Car
US Patent
LigandPNGBDBM397193(US10596172, Compound I-131 | US10828300, Compound ...)
Affinity DataIC50: <100nM. Assay description: Briefly, 10x stocks of EGFR-WT (PV3872) from Invitrogen and EGFR-T790M/L858R (40350) from BPS Bioscience, San Diego, Calif., 1.13×ATP (AS001A) and ap...
Ligand InfoPC cidPC sid
In DepthDetails US Patent
TargetEpidermal growth factor receptor(Homo sapiens (Human))
Celgene Car
US Patent
LigandPNGBDBM397193(US10596172, Compound I-131 | US10828300, Compound ...)
Affinity DataIC50: <10nM. Assay description: Briefly, 10× stocks of EGFR-WT (PV3872) from Invitrogen and EGFR-T790M/L858R (40350) from BPS Bioscience, San Diego, Calif., 1.13×ATP (AS001A) and ap...
Ligand InfoPC cidPC sid
In DepthDetails US Patent
TargetTyrosine-protein kinase BTK(Homo sapiens (Human))
Celgene Car
US Patent
LigandPNGBDBM397193(US10596172, Compound I-131 | US10828300, Compound ...)
Affinity DataIC50: <10nM. Assay description: Briefly, 10× stocks of EGFR-WT (PV3872) from Invitrogen and EGFR-T790M/L858R (40350) from BPS Bioscience, San Diego, Calif., 1.13×ATP (AS001A) and ap...
Ligand InfoPC cidPC sid
In DepthDetails US Patent
TargetTyrosine-protein kinase BTK(Homo sapiens (Human))
Celgene Car
US Patent
LigandPNGBDBM397193(US10596172, Compound I-131 | US10828300, Compound ...)
Affinity DataIC50: <100nM. Assay description: Briefly, 10x stocks of EGFR-WT (PV3872) from Invitrogen and EGFR-T790M/L858R (40350) from BPS Bioscience, San Diego, Calif., 1.13×ATP (AS001A) and ap...
Ligand InfoPC cidPC sid
In DepthDetails US Patent
TargetTyrosine-protein kinase ITK/TSK(Homo sapiens (Human))
Celgene Car
US Patent
LigandPNGBDBM397193(US10596172, Compound I-131 | US10828300, Compound ...)
Affinity DataIC50: <100nM. Assay description: Briefly, 10x stocks of EGFR-WT (PV3872) from Invitrogen and EGFR-T790M/L858R (40350) from BPS Bioscience, San Diego, Calif., 1.13×ATP (AS001A) and ap...
Ligand InfoPC cidPC sid
In DepthDetails US Patent
TargetCytoplasmic tyrosine-protein kinase BMX(Homo sapiens (Human))
Celgene Car
US Patent
LigandPNGBDBM397193(US10596172, Compound I-131 | US10828300, Compound ...)
Affinity DataIC50: <100nM. Assay description: Briefly, 10x stocks of EGFR-WT (PV3872) from Invitrogen and EGFR-T790M/L858R (40350) from BPS Bioscience, San Diego, Calif., 1.13×ATP (AS001A) and ap...
Ligand InfoPC cidPC sid
In DepthDetails US Patent
TargetCytoplasmic tyrosine-protein kinase BMX(Homo sapiens (Human))
Celgene Car
US Patent
LigandPNGBDBM397193(US10596172, Compound I-131 | US10828300, Compound ...)
Affinity DataIC50: <10nM. Assay description: Briefly, 10× stocks of EGFR-WT (PV3872) from Invitrogen and EGFR-T790M/L858R (40350) from BPS Bioscience, San Diego, Calif., 1.13×ATP (AS001A) and ap...
Ligand InfoPC cidPC sid
In DepthDetails US Patent