BDBM400823 QL-XII-47-AL::US10000483, Compound II-20
SMILES CN(C\C=C\CN1CCc2ccc(cc12)-n1c2c(ccc1=O)cnc1ccc(cc21)-c1cnn(C)c1)CC#C
InChI Key InChIKey=VJDVKRQPRSCAPE-AATRIKPKSA-N
Data  3 IC50
  Tab Delimited (TSV)   2D SDfile   Computed 3D by Vconf -m prep SDfile
Find this compound or compounds like it in BindingDB:
Activity Spreadsheet -- Enzyme Inhibition Constant Data from BindingDB
Found 3 hits for monomerid = 400823
TargetCytoplasmic tyrosine-protein kinase BMX(Homo sapiens (Human))
Dana-Farber Cancer Institute
US Patent
LigandPNGBDBM400823(QL-XII-47-AL | US10000483, Compound II-20)
Affinity DataIC50:  479nM. Assay description: Purified BMX was mixed with substrate (FAK or Bmxtides), kinase buffer (final 20 mM HEPES, pH 7.5, 10 mM MgCl2, 20 mM β-glycerophosphate, 1 mM d...
Ligand InfoPC cidPC sid
In DepthDetails US Patent
TargetCytoplasmic tyrosine-protein kinase BMX(Homo sapiens (Human))
Dana-Farber Cancer Institute
US Patent
LigandPNGBDBM400823(QL-XII-47-AL | US10000483, Compound II-20)
Affinity DataIC50:  479nM. Assay description: DiscoverX binding assays were performed according to published methods (Fabian et al., Nat. Biotechnol. 23, 329-36 (2005); Davis et al., Nat. Biotech...
Ligand InfoPC cidPC sid
In DepthDetails US Patent
TargetTyrosine-protein kinase BTK(Homo sapiens (Human))
Dana-Farber Cancer Institute
US Patent
LigandPNGBDBM400823(QL-XII-47-AL | US10000483, Compound II-20)
Affinity DataIC50:  641nM. Assay description: DiscoverX binding assays were performed according to published methods (Fabian et al., Nat. Biotechnol. 23, 329-36 (2005); Davis et al., Nat. Biotech...
Ligand InfoPC cidPC sid
In DepthDetails US Patent