BDBM402042 Preparation of N-(3-(5-chloro-2-(4-fluoro-3-(N-methylacrylamido)phenylamino)pyrimidinyl-4-amino)propyl)-4-fluorobenzamide::US10011571, Example 23
SMILES CN(C(=O)C=C)c1cc(Nc2ncc(Cl)c(NCCCNC(=O)c3ccc(F)cc3)n2)ccc1F
InChI Key InChIKey=DYIBUWLFYBFBBS-UHFFFAOYSA-N
Data  8 IC50
  Tab Delimited (TSV)   2D SDfile   Computed 3D by Vconf -m prep SDfile
Find this compound or compounds like it in BindingDB:
Activity Spreadsheet -- Enzyme Inhibition Constant Data from BindingDB
Found 8 hits for monomerid = 402042
TargetTyrosine-protein kinase JAK3(Homo sapiens (Human))
Shenzhen Chipscreen Biosciences
US Patent
LigandPNGBDBM402042(Preparation of N-(3-(5-chloro-2-(4-fluoro-3-(N-met...)
Affinity DataIC50:  11nM. Assay description: Briefly, according to the requirements of different kinase reactions, 0.2 μL test compound (50 μM, dissolved in dimethyl sulfoxide (DMSO)) ...
Ligand InfoPC cidPC sid
In DepthDetails US Patent
TargetTyrosine-protein kinase JAK1(Homo sapiens (Human))
Shenzhen Chipscreen Biosciences
US Patent
LigandPNGBDBM402042(Preparation of N-(3-(5-chloro-2-(4-fluoro-3-(N-met...)
Affinity DataIC50:  173nM. Assay description: Briefly, according to the requirements of different kinase reactions, 0.2 μL test compound (50 μM, dissolved in dimethyl sulfoxide (DMSO)) ...
Ligand InfoPC cidPC sid
In DepthDetails US Patent
TargetTyrosine-protein kinase JAK2(Homo sapiens (Human))
Shenzhen Chipscreen Biosciences
US Patent
LigandPNGBDBM402042(Preparation of N-(3-(5-chloro-2-(4-fluoro-3-(N-met...)
Affinity DataIC50:  1.92E+3nM. Assay description: Briefly, according to the requirements of different kinase reactions, 0.2 μL test compound (50 μM, dissolved in dimethyl sulfoxide (DMSO)) ...
Ligand InfoPC cidPC sid
In DepthDetails US Patent
TargetVascular endothelial growth factor receptor 3(Homo sapiens (Human))
Shenzhen Chipscreen Biosciences
US Patent
LigandPNGBDBM402042(Preparation of N-(3-(5-chloro-2-(4-fluoro-3-(N-met...)
Affinity DataIC50:  42nM. Assay description: Briefly, according to the requirements of different kinase reactions, 0.2 μL test compound (50 μM, dissolved in dimethyl sulfoxide (DMSO)) ...
Ligand InfoPC cidPC sid
In DepthDetails US Patent
TargetTyrosine-protein kinase Blk(Homo sapiens (Human))
Shenzhen Chipscreen Biosciences
US Patent
LigandPNGBDBM402042(Preparation of N-(3-(5-chloro-2-(4-fluoro-3-(N-met...)
Affinity DataIC50:  855nM. Assay description: Briefly, according to the requirements of different kinase reactions, 0.2 μL test compound (50 μM, dissolved in dimethyl sulfoxide (DMSO)) ...
Ligand InfoPC cidPC sid
In DepthDetails US Patent
TargetSerine/threonine-protein kinase TBK1(Homo sapiens (Human))
Shenzhen Chipscreen Biosciences
US Patent
LigandPNGBDBM402042(Preparation of N-(3-(5-chloro-2-(4-fluoro-3-(N-met...)
Affinity DataIC50:  664nM. Assay description: Briefly, according to the requirements of different kinase reactions, 0.2 μL test compound (50 μM, dissolved in dimethyl sulfoxide (DMSO)) ...
Ligand InfoPC cidPC sid
In DepthDetails US Patent
TargetVascular endothelial growth factor receptor 1(Homo sapiens (Human))
Shenzhen Chipscreen Biosciences
US Patent
LigandPNGBDBM402042(Preparation of N-(3-(5-chloro-2-(4-fluoro-3-(N-met...)
Affinity DataIC50:  1.23E+3nM. Assay description: Briefly, according to the requirements of different kinase reactions, 0.2 μL test compound (50 μM, dissolved in dimethyl sulfoxide (DMSO)) ...
Ligand InfoPC cidPC sid
In DepthDetails US Patent
TargetTyrosine-protein kinase ITK/TSK(Homo sapiens (Human))
Shenzhen Chipscreen Biosciences
US Patent
LigandPNGBDBM402042(Preparation of N-(3-(5-chloro-2-(4-fluoro-3-(N-met...)
Affinity DataIC50: >1.00E+4nM. Assay description: Briefly, according to the requirements of different kinase reactions, 0.2 μL test compound (50 μM, dissolved in dimethyl sulfoxide (DMSO)) ...
Ligand InfoPC cidPC sid
In DepthDetails US Patent