BDBM404014 US10336717, Compound 305
SMILES COC1CCC2(Cc3ccc(cc3C22NC(=S)N(Cc3nnc(C)o3)C2=O)C#CC2CC2)CC1
InChI Key InChIKey=IUHHTHUKPLIDCQ-UHFFFAOYSA-N
Data  1 IC50
  Tab Delimited (TSV)   2D SDfile   Computed 3D by Vconf -m prep SDfile
Find this compound or compounds like it in BindingDB:
Activity Spreadsheet -- Enzyme Inhibition Constant Data from BindingDB
Found 1 hit for monomerid = 404014
TargetBeta-secretase 1(Homo sapiens (Human))
Vitae Pharmaceuticals
US Patent
LigandPNGBDBM404014(US10336717, Compound 305)
Affinity DataIC50:  4.30nM. Assay description: For each compound being tested, the BACE activity was monitored in a fluorescence quenching assay (FRET) using the ectodomain of BACE (aa 1-454) fuse...
Ligand InfoPC cidPC sid
In DepthDetails US Patent