BDBM40598 2-[(4-amino-7-methyl-6,8-dihydro-5H-pyrido[4,5]thieno[1,2-c]pyrimidin-2-yl)thio]ethyl-dimethyl-amine::2-[2-(dimethylamino)ethylsulfanyl]-7-methyl-6,8-dihydro-5H-pyrido[4,5]thieno[1,2-c]pyrimidin-4-amine::2-[2-(dimethylamino)ethylthio]-7-methyl-6,8-dihydro-5H-pyrido[4,5]thieno[1,2-c]pyrimidin-4-amine::MLS000082607::SMR000045071::cid_664126
SMILES CN(C)CCSc1nc(N)c2c3CCN(C)Cc3sc2n1
InChI Key InChIKey=VIVCAVMKYXPBHO-UHFFFAOYSA-N
Data  1 IC50
  Tab Delimited (TSV)   2D SDfile   Computed 3D by Vconf -m prep SDfile
Find this compound or compounds like it in BindingDB:
Activity Spreadsheet -- Enzyme Inhibition Constant Data from BindingDB
Found 1 hit for monomerid = 40598
TargetNuclear receptor subfamily 4 group A member 1(Homo sapiens (Human))
Burnham Center For Chemical Genomics
Curated by PubChem BioAssay
LigandPNGBDBM40598(2-[(4-amino-7-methyl-6,8-dihydro-5H-pyrido[4,5]thi...)
Affinity DataIC50:  4.62E+4nM. Assay description: Sanford-Burnham Center for Chemical Genomics (SBCCG) Sanford-Burnham Medical Research Institute (San Diego, CA) NIH Molecular Libraries Screening Cen...
In DepthDetails PCBioAssay