BDBM406221 6-(((4-chlorophenyl) thio) methyl)-4-oxo-4H-pyran-3-yl 4-(4-chlorophenethyl)-1H-pyrrole-2-carboxylate::US10336724, Compound 14
SMILES Clc1ccc(CCc2c[nH]c(c2)C(=O)Oc2coc(CSc3ccc(Cl)cc3)cc2=O)cc1
InChI Key InChIKey=ZTPNVPVSGTZCTA-UHFFFAOYSA-N
Data  2 IC50
  Tab Delimited (TSV)   2D SDfile   Computed 3D by Vconf -m prep SDfile
Find this compound or compounds like it in BindingDB:
Activity Spreadsheet -- Enzyme Inhibition Constant Data from BindingDB
Found 2 hits for monomerid = 406221
TargetD-amino-acid oxidase(Sus scrofa (pig))
SyneuRx International (Taiwan)
US Patent
LigandPNGBDBM406221(6-(((4-chlorophenyl) thio) methyl)-4-oxo-4H-pyran-...)
Affinity DataIC50:  5.50E+4nM. Assay description: The pkDAAO (porcine kidney DAAO) activity was measured by using D-Proine as a substrate to produce hydrogen peroxide (H2O2). The produced H2O2 would ...
Ligand InfoPC cidPC sid
In DepthDetails US Patent
TargetD-amino-acid oxidase(Homo sapiens (Human))
SyneuRx International (Taiwan)
US Patent
LigandPNGBDBM406221(6-(((4-chlorophenyl) thio) methyl)-4-oxo-4H-pyran-...)
Affinity DataIC50:  5.50E+3nM. Assay description: The hDAAO (human DAAO) activity was measured by using D-serine as a substrate to produce H2O2. The produced H2O2 would be oxidized by peroxidase, and...
Ligand InfoPC cidPC sid
In DepthDetails US Patent