BDBM406391 N-(tert-Butylsulfonyl)-2-((rac-trans)-4-hydroxy-3-((1-methyl-1H-pyrazol-5-yl)methyl)chroman-7-yl)benzamide::US10336733, Example 35
SMILES Cn1nccc1C[C@H]1COc2cc(ccc2[C@@H]1O)-c1ccccc1C(=O)NS(=O)(=O)C(C)(C)C
InChI Key InChIKey=SATFCRCFEADIQC-GAJHUEQPSA-N
Data  1 EC50
  Tab Delimited (TSV)   2D SDfile   Computed 3D by Vconf -m prep SDfile
Find this compound or compounds like it in BindingDB:
Activity Spreadsheet -- Enzyme Inhibition Constant Data from BindingDB
Found 1 hit for monomerid = 406391
TargetLeukotriene B4 receptor 1(Homo sapiens (Human))
Merk Sharp & Dohme
US Patent
LigandPNGBDBM406391(N-(tert-Butylsulfonyl)-2-((rac-trans)-4-hydroxy-3-...)
Affinity DataEC50:  95nM. Assay description: The ability of compounds to antagonize the human BLT1 receptor was determined using a kit to measure changes in intracellular cyclic AMP levels (cAMP...
Ligand InfoPC cidPC sid
In DepthDetails US Patent