BDBM406967 (3S)-1-({2-[6-(difluoromethyl)pyridin-2-yl]-4-[(3-fluoropyridin-4-yl)amino]pyrrolo[2,1-f][1,2,4]triazin-5-yl}methyl)pyrrolidin-3-ol::US10336761, Example 251
SMILES O[C@H]1CCN(Cc2ccn3nc(nc(Nc4ccncc4F)c23)-c2cccc(n2)C(F)F)C1
InChI Key InChIKey=KYGGBIHPYVWDIQ-AWEZNQCLSA-N
Data  2 IC50
  Tab Delimited (TSV)   2D SDfile   Computed 3D by Vconf -m prep SDfile
Find this compound or compounds like it in BindingDB:
Activity Spreadsheet -- Enzyme Inhibition Constant Data from BindingDB
Found 2 hits for monomerid = 406967
TargetTGF-beta receptor type-2(Homo sapiens (Human))
Bristol-Myers Squibb
US Patent
LigandPNGBDBM406967((3S)-1-({2-[6-(difluoromethyl)pyridin-2-yl]-4-[(3-...)
Affinity DataIC50:  680nM. Assay description: Assays are conducted in 1536-well plates and 2 mL reactions are prepared from addition of HIS-TGFβR1 T204D or HIS-TGFβR2 WT, anti-HIS detec...
Ligand InfoPC cidPC sid
In DepthDetails US Patent
TargetTGF-beta receptor type-1(Homo sapiens (Human))
Bristol-Myers Squibb
US Patent
LigandPNGBDBM406967((3S)-1-({2-[6-(difluoromethyl)pyridin-2-yl]-4-[(3-...)
Affinity DataIC50:  0.590nM. Assay description: Assays are conducted in 1536-well plates and 2 mL reactions are prepared from addition of HIS-TGFβR1 T204D or HIS-TGFβR2 WT, anti-HIS detec...
Ligand InfoPC cidPC sid
In DepthDetails US Patent