BDBM409984 2-Amino-8-(6-phenyl-3,6-diazabicyclo[3.2.0]heptane-3-carbonyl)-N,N-dipropyl-3H-1-benzazepine-4-carboxamide::US10370338, Example 16
SMILES CCCN(CCC)C(=O)C1=Cc2ccc(cc2N=C(N)C1)C(=O)N1CC2CN(C2C1)c1ccccc1
InChI Key InChIKey=GFSJWJQNTDLWQR-UHFFFAOYSA-N
Data  2 EC50
  Tab Delimited (TSV)   2D SDfile   Computed 3D by Vconf -m prep SDfile
Find this compound or compounds like it in BindingDB:
Activity Spreadsheet -- Enzyme Inhibition Constant Data from BindingDB
Found 2 hits for monomerid = 409984
TargetToll-like receptor 7(Homo sapiens (Human))
Hoffmann-La Roche
US Patent
LigandPNGBDBM409984(2-Amino-8-(6-phenyl-3,6-diazabicyclo[3.2.0]heptane...)
Affinity DataEC50:  1.20E+4nM. Assay description: For TLR8 and TLR7 activity testing, HEK-Blue human TLR8 or TLR7 cells (Invivogen, San Diego, Calif., USA) are used, respectively. These cells are des...
Ligand InfoPC cidPC sid
In DepthDetails US Patent
TargetToll-like receptor 8(Homo sapiens (Human))
Hoffmann-La Roche
US Patent
LigandPNGBDBM409984(2-Amino-8-(6-phenyl-3,6-diazabicyclo[3.2.0]heptane...)
Affinity DataEC50:  29nM. Assay description: For TLR8 and TLR7 activity testing, HEK-Blue human TLR8 or TLR7 cells (Invivogen, San Diego, Calif., USA) are used, respectively. These cells are des...
Ligand InfoPC cidPC sid
In DepthDetails US Patent