BDBM410884 US10383880, Example 97
SMILES OC(CN1CCCS1(=O)=O)Cn1c2cc(F)ccc2c2c(F)cccc12
InChI Key InChIKey=HLSASWBSLUMYQF-UHFFFAOYSA-N
Data  1 EC50
  Tab Delimited (TSV)   2D SDfile   Computed 3D by Vconf -m prep SDfile
Find this compound or compounds like it in BindingDB:
Activity Spreadsheet -- Enzyme Inhibition Constant Data from BindingDB
Found 1 hit for monomerid = 410884
TargetPeriod circadian protein homolog 2(Homo sapiens (Human))
Synchronicity
US Patent
LigandPNGBDBM410884(US10383880, Example 97)
Affinity DataEC50:  319nM. Assay description: Per2 Assay for Evaluating the Potency of Test Compounds.
Ligand InfoPC cidPC sid
In DepthDetails US Patent