BDBM411341 US10385031, Compound 047::US10385031, Compound 049::US10774056, Compound 047::US11542242, Compound 047
SMILES Nc1ccc(cc1NC(=O)c1cnc(s1)N1CCNCC1)-c1ccccc1
InChI Key InChIKey=USGQWGYCSMDODO-UHFFFAOYSA-N
Data  12 IC50
  Tab Delimited (TSV)   2D SDfile   Computed 3D by Vconf -m prep SDfile
Find this compound or compounds like it in BindingDB:
Activity Spreadsheet -- Enzyme Inhibition Constant Data from BindingDB
Found 12 hits for monomerid = 411341
TargetHistone deacetylase 1(Homo sapiens (Human))
Regenacy Pharmaceuticals
US Patent
LigandPNGBDBM411341(US10385031, Compound 047 | US10385031, Compound 04...)
Affinity DataIC50: <10nM. Assay description: Compounds for testing were diluted in DMSO to 50 fold the final concentration and a ten-point three-fold dilution series was made. The compounds were...
Ligand InfoPC cidPC sid
In DepthDetails US Patent
TargetHistone deacetylase 2(Homo sapiens (Human))
Regenacy Pharmaceuticals
US Patent
LigandPNGBDBM411341(US10385031, Compound 047 | US10385031, Compound 04...)
Affinity DataIC50: <1.00E+3nM. Assay description: Compounds for testing were diluted in DMSO to 50 fold the final concentration and a ten-point three-fold dilution series was made. The compounds were...
Ligand InfoPC cidPC sid
In DepthDetails US Patent
TargetHistone deacetylase 3(Homo sapiens (Human))
Regenacy Pharmaceuticals
US Patent
LigandPNGBDBM411341(US10385031, Compound 047 | US10385031, Compound 04...)
Affinity DataIC50: >500nM. Assay description: Compounds for testing were diluted in DMSO to 50 fold the final concentration and a ten-point three-fold dilution series was made. The compounds were...
Ligand InfoPC cidPC sid
In DepthDetails US Patent
TargetHistone deacetylase 1(Homo sapiens (Human))
Regenacy Pharmaceuticals
US Patent
LigandPNGBDBM411341(US10385031, Compound 047 | US10385031, Compound 04...)
Affinity DataIC50: <10nM. Assay description: Compounds for testing were diluted in DMSO to 50 fold the final concentration and a ten-point three-fold dilution series was made. The compounds were...
Ligand InfoPC cidPC sid
In DepthDetails US Patent
TargetHistone deacetylase 2(Homo sapiens (Human))
Regenacy Pharmaceuticals
US Patent
LigandPNGBDBM411341(US10385031, Compound 047 | US10385031, Compound 04...)
Affinity DataIC50: <1.00E+3nM. Assay description: Compounds for testing were diluted in DMSO to 50 fold the final concentration and a ten-point three-fold dilution series was made. The compounds were...
Ligand InfoPC cidPC sid
In DepthDetails US Patent
TargetHistone deacetylase 3(Homo sapiens (Human))
Regenacy Pharmaceuticals
US Patent
LigandPNGBDBM411341(US10385031, Compound 047 | US10385031, Compound 04...)
Affinity DataIC50: >500nM. Assay description: Compounds for testing were diluted in DMSO to 50 fold the final concentration and a ten-point three-fold dilution series was made. The compounds were...
Ligand InfoPC cidPC sid
In DepthDetails US Patent
TargetHistone deacetylase 1(Homo sapiens (Human))
Regenacy Pharmaceuticals
US Patent
LigandPNGBDBM411341(US10385031, Compound 047 | US10385031, Compound 04...)
Affinity DataIC50: <10nM. Assay description: Compounds for testing were diluted in DMSO to 50 fold the final concentration and a ten-point three-fold dilution series was made. The compounds were...
Ligand InfoPC cidPC sid
In DepthDetails US Patent
TargetHistone deacetylase 2(Homo sapiens (Human))
Regenacy Pharmaceuticals
US Patent
LigandPNGBDBM411341(US10385031, Compound 047 | US10385031, Compound 04...)
Affinity DataIC50:  255nM
Ligand InfoPC cidPC sid
In DepthDetails US Patent
TargetHistone deacetylase 3(Homo sapiens (Human))
Regenacy Pharmaceuticals
US Patent
LigandPNGBDBM411341(US10385031, Compound 047 | US10385031, Compound 04...)
Affinity DataIC50: >500nM
Ligand InfoPC cidPC sid
In DepthDetails US Patent
TargetHistone deacetylase 1(Homo sapiens (Human))
Regenacy Pharmaceuticals
US Patent
LigandPNGBDBM411341(US10385031, Compound 047 | US10385031, Compound 04...)
Affinity DataIC50: <10nM. Assay description: Compounds for testing were diluted in DMSO to 50 fold the final concentration and a ten-point three-fold dilution series was made. The compounds were...
Ligand InfoPC cidPC sid
In DepthDetails US Patent
TargetHistone deacetylase 2(Homo sapiens (Human))
Regenacy Pharmaceuticals
US Patent
LigandPNGBDBM411341(US10385031, Compound 047 | US10385031, Compound 04...)
Affinity DataIC50:  255nM. Assay description: Compounds for testing were diluted in DMSO to 50 fold the final concentration and a ten-point three-fold dilution series was made. The compounds were...
Ligand InfoPC cidPC sid
In DepthDetails US Patent
TargetHistone deacetylase 3(Homo sapiens (Human))
Regenacy Pharmaceuticals
US Patent
LigandPNGBDBM411341(US10385031, Compound 047 | US10385031, Compound 04...)
Affinity DataIC50: <1.00E+3nM. Assay description: Compounds for testing were diluted in DMSO to 50 fold the final concentration and a ten-point three-fold dilution series was made. The compounds were...
Ligand InfoPC cidPC sid
In DepthDetails US Patent