BDBM41197 Cyclopropanecarboxylic acid (2-{2-[(4-ethoxy-phenylcarbamoyl)-methyl]-2H-tetrazol-5-yl}-phenyl)-amide::MLS000072651::N-[2-[2-[2-(4-ethoxyanilino)-2-oxoethyl]-5-tetrazolyl]phenyl]cyclopropanecarboxamide::N-[2-[2-[2-(4-ethoxyanilino)-2-oxoethyl]tetrazol-5-yl]phenyl]cyclopropanecarboxamide::N-[2-[2-[2-[(4-ethoxyphenyl)amino]-2-oxidanylidene-ethyl]-1,2,3,4-tetrazol-5-yl]phenyl]cyclopropanecarboxamide::N-[2-[2-[2-keto-2-(p-phenetidino)ethyl]tetrazol-5-yl]phenyl]cyclopropanecarboxamide::SMR000013569::cid_650575
SMILES CCOc1ccc(NC(=O)Cn2nnc(n2)-c2ccccc2NC(=O)C2CC2)cc1
InChI Key InChIKey=PNEPUJAZXOHCTC-UHFFFAOYSA-N
Data  1 IC50
  Tab Delimited (TSV)   2D SDfile   Computed 3D by Vconf -m prep SDfile
Find this compound or compounds like it in BindingDB:
Activity Spreadsheet -- Enzyme Inhibition Constant Data from BindingDB
Found 1 hit for monomerid = 41197
TargetDNA-directed RNA polymerase subunit beta(Escherichia coli)
Pcmd
Curated by PubChem BioAssay
LigandPNGBDBM41197(Cyclopropanecarboxylic acid (2-{2-[(4-ethoxy-pheny...)
Affinity DataIC50: >5.00E+4nM. Assay description: Screening Center: Penn Center for Molecular Discovery Center Affiliation: University of Pennsylvania Network: Molecular Library Screening Center Netw...
In DepthDetails PCBioAssay