BDBM412823 US10399989, Example 36::US10611766, Example 36
SMILES COc1ccccc1C(=O)NCc1ccc(cc1)-c1nn([C@@H]2C[C@@H](O)C=C2)c2ncnc(N)c12
InChI Key InChIKey=MPYBIRVGTIQZJU-ROUUACIJSA-N
Data  6 IC50
  Tab Delimited (TSV)   2D SDfile   Computed 3D by Vconf -m prep SDfile
Find this compound or compounds like it in BindingDB:
Activity Spreadsheet -- Enzyme Inhibition Constant Data from BindingDB
Found 6 hits for monomerid = 412823
TargetTyrosine-protein kinase BTK(Homo sapiens (Human))
Loxo Oncology
US Patent
LigandPNGBDBM412823(US10399989, Example 36 | US10611766, Example 36)
Affinity DataIC50: <10nM. Assay description: BTKWT binding affinity of each compound tested was determined using a time-resolved fluorescence resonance energy transfer (TR-FRET) methodology. 2.5...
Ligand Info
In DepthDetails US Patent
TargetTyrosine-protein kinase BTK [C481S](Homo sapiens (Human))
Loxo Oncology
US Patent
LigandPNGBDBM412823(US10399989, Example 36 | US10611766, Example 36)
Affinity DataIC50: <10nM. Assay description: BTKC481S binding affinity of each compound tested was determined using a time-resolved fluorescence resonance energy transfer (TR-FRET) methodology. ...
Ligand Info
In DepthDetails US Patent
TargetEpidermal growth factor receptor(Homo sapiens (Human))
Loxo Oncology
US Patent
LigandPNGBDBM412823(US10399989, Example 36 | US10611766, Example 36)
Affinity DataIC50:  550nM. Assay description: EGFR binding affinity was determined using a time-resolved fluorescence resonance energy transfer (TR-FRET) methodology. 2.5 nM Recombinant EGFR, var...
Ligand Info
In DepthDetails US Patent
TargetTyrosine-protein kinase BTK(Homo sapiens (Human))
Loxo Oncology
US Patent
LigandPNGBDBM412823(US10399989, Example 36 | US10611766, Example 36)
Affinity DataIC50: <10nM. Assay description: BTKWT binding affinity of each compound tested was determined using a time-resolved fluorescence resonance energy transfer (TR-FRET) methodology. 2.5...
Ligand Info
In DepthDetails US Patent
TargetTyrosine-protein kinase BTK [C481S](Homo sapiens (Human))
Loxo Oncology
US Patent
LigandPNGBDBM412823(US10399989, Example 36 | US10611766, Example 36)
Affinity DataIC50: <10nM. Assay description: BTKC481S binding affinity of each compound tested was determined using a time-resolved fluorescence resonance energy transfer (TR-FRET) methodology. ...
Ligand Info
In DepthDetails US Patent
TargetEpidermal growth factor receptor(Homo sapiens (Human))
Loxo Oncology
US Patent
LigandPNGBDBM412823(US10399989, Example 36 | US10611766, Example 36)
Affinity DataIC50:  550nM. Assay description: EGFR binding affinity was determined using a time-resolved fluorescence resonance energy transfer (TR-FRET) methodology. 2.5 nM Recombinant EGFR, var...
Ligand Info
In DepthDetails US Patent